{"text_format":"1","workbook":"xlsx","n_sheets":6,"sheets":["klas_indywidualna (2)","baza","wklejone_dane","klasyfikacja","Zawody_2021_klubowa","klas_indywidualna"],"not_rendered":{"charts":0,"images":7,"macros":1,"external_links":0,"defined_names":9,"comments":0,"pivot_tables":0},"unopened":[],"bounds":{"document_bytes":16777216,"sheet_cells":100000,"rows_first":2000,"rows_last":500,"rows_between":2000,"halvings":0,"cell_chars":16384,"cell_head_chars":4096},"cells_cut":0,"cells_raw":0,"read":"whole","date_system":"1900"}

{"sheet":"klas_indywidualna (2)","index":0,"n_rows":113,"n_cols":30,"rows_kept":113,"cut":false,"hidden":false,"merged":[]}
[null,null,"Klasyfikacja po VI zawodach \n(z uwzględnieniem zasady: 6 zawodów minus najsłabszy wynik.\nNatomiast zawodnicy, którzy nie uczestniczyli we wszyskich zawodach otrzymali sumę punktów)",null,null,null,null,null,null,null,null,null,null,null,null,null,null,null,null,null,null,null,"Klasyfikacja klubowa po VI zawodach"]
["M-ce","Grupa","NAZWISKO i Imię","rok. ur.","Klub","liczba","wynik","Zawody_1","Zawody_2","Zawody_3","Zawody_4","Zawody_5","Zawody_6",null,null,null,null,null,null,null,null,"M-ce","Klub","Suma","Zawody_1","Zawody_2","Zawody_3","Zawody_4","Zawody_5","Zawody_6"]
[{"$f":"IF(Zawody_2021_klas_indywidualna9[[#This Row],[Grupa]]=\"\",\"\",COUNTIF($B$3:B3,B3))","v":1},"Gr. 1","LEŚNIAK Zofia-Katarzyna ",2013,"KN Gondola Krynica",6,300,60,60,60,60,60,60,null,null,null,null,{"$f":"IF(B3=\"\",\"\",MOD(IF(B3=B2,R2,R2+1),2)=1)","v":true},null,null,null,1,"UKN LAWORTA Ustrzyki Dolne",8479,1366,1372,1392,1414,1426,1509]
[{"$f":"IF(Zawody_2021_klas_indywidualna9[[#This Row],[Grupa]]=\"\",\"\",COUNTIF($B$3:B4,B4))","v":2},"Gr. 1","MACH Milena ",2013,"KN Przemyśl SKI",6,250,30,50,50,50,50,50,null,null,null,null,true,null,null,null,2,"KN Przemyśl SKI",2937,631,584,445,390,469,418]
[{"$f":"IF(Zawody_2021_klas_indywidualna9[[#This Row],[Grupa]]=\"\",\"\",COUNTIF($B$3:B5,B5))","v":3},"Gr. 1","GRĘDA Agata ",2013,"KN Przemyśl SKI",5,195,50,40,null,35,35,35,null,null,null,null,true,null,null,null,3,"KN Gondola Krynica",1880,330,330,290,340,270,320]
[{"$f":"IF(Zawody_2021_klas_indywidualna9[[#This Row],[Grupa]]=\"\",\"\",COUNTIF($B$3:B6,B6))","v":4},"Gr. 1","MOSUREK Marcelina ",2013,"UKN LAWORTA Ustrzyki Dolne",5,175,35,30,null,30,40,40,null,null,null,null,true,null,null,null,4,"SKN Jasło przy ZSM Nr 1",1207,187,151,146,235,209,279]
[{"$f":"IF(Zawody_2021_klas_indywidualna9[[#This Row],[Grupa]]=\"\",\"\",COUNTIF($B$3:B7,B7))","v":5},"Gr. 1","MOSUREK Zofia ",2013,"UKN LAWORTA Ustrzyki Dolne",3,115,40,35,null,40,null,null,null,null,null,null,true,null,null,null,5,"UKS Gwożdzik Gwoźnica D.",935,null,null,135,213,315,272]
[{"$f":"IF(Zawody_2021_klas_indywidualna9[[#This Row],[Grupa]]=\"\",\"\",COUNTIF($B$3:B8,B8))","v":6},"Gr. 1","TUREK Karolina ",2013,"UKN LAWORTA Ustrzyki Dolne",1,30,null,null,null,null,null,30,null,null,null,null,true,null,null,null,6,"UKS Śródmieście Przemyśl",677,148,131,120,90,78,110]
[{"$f":"IF(Zawody_2021_klas_indywidualna9[[#This Row],[Grupa]]=\"\",\"\",COUNTIF($B$3:B9,B9))","v":7},"Gr. 1","PUCYŁO Michalina ",2013,"UKN LAWORTA Ustrzyki Dolne",1,30,null,null,null,null,30,null,null,null,null,null,true,null,null,null,7,"Magura Gorlice",200,null,null,50,50,50,50]
[{"$f":"IF(Zawody_2021_klas_indywidualna9[[#This Row],[Grupa]]=\"\",\"\",COUNTIF($B$3:B10,B10))","v":8},"Gr. 1","KOKOSZYŃSKA Zuzanna ",2016,"UKN LAWORTA Ustrzyki Dolne",1,28,null,null,null,null,28,null,null,null,null,null,true,null,null,null,8,"Niestowarzyszony",134,null,null,null,null,66,68]
[{"$f":"IF(Zawody_2021_klas_indywidualna9[[#This Row],[Grupa]]=\"\",\"\",COUNTIF($B$3:B11,B11))","v":1},"Gr. 2","SZUKALSKI Patryk ",2013,"UKN LAWORTA Ustrzyki Dolne",6,300,40,60,60,60,60,60,null,null,null,null,false,null,null,null,9,"PTN Przemyśl",82,56,26]
[{"$f":"IF(Zawody_2021_klas_indywidualna9[[#This Row],[Grupa]]=\"\",\"\",COUNTIF($B$3:B12,B12))","v":2},"Gr. 2","KULIGOWSKI Jerzy ",2013,"UKS Śródmieście Przemyśl",6,260,60,40,50,50,50,50,null,null,null,null,false]
[{"$f":"IF(Zawody_2021_klas_indywidualna9[[#This Row],[Grupa]]=\"\",\"\",COUNTIF($B$3:B13,B13))","v":3},"Gr. 2","GAJDEK Maksymilian ",2014,"UKN LAWORTA Ustrzyki Dolne",6,220,50,50,40,40,35,40,null,null,null,null,false]
[{"$f":"IF(Zawody_2021_klas_indywidualna9[[#This Row],[Grupa]]=\"\",\"\",COUNTIF($B$3:B14,B14))","v":4},"Gr. 2","PABIS Filip ",2013,"UKN LAWORTA Ustrzyki Dolne",5,180,null,35,35,35,40,35,null,null,null,null,false]
[{"$f":"IF(Zawody_2021_klas_indywidualna9[[#This Row],[Grupa]]=\"\",\"\",COUNTIF($B$3:B15,B15))","v":5},"Gr. 2","SZOPNIEWSKI Michał ",2013,"SKN Jasło przy ZSM Nr 1",6,144,30,30,24,28,28,28,null,null,null,null,false]
[{"$f":"IF(Zawody_2021_klas_indywidualna9[[#This Row],[Grupa]]=\"\",\"\",COUNTIF($B$3:B16,B16))","v":6},"Gr. 2","LEJOWSKI Filip ",2013,"UKN LAWORTA Ustrzyki Dolne",4,118,null,null,28,30,30,30,null,null,null,null,false]
[{"$f":"IF(Zawody_2021_klas_indywidualna9[[#This Row],[Grupa]]=\"\",\"\",COUNTIF($B$3:B17,B17))","v":7},"Gr. 2","BUGERA Antoni ",2013,"KN Przemyśl SKI",2,65,35,null,30,null,null,null,null,null,null,null,false]
[{"$f":"IF(Zawody_2021_klas_indywidualna9[[#This Row],[Grupa]]=\"\",\"\",COUNTIF($B$3:B18,B18))","v":8},"Gr. 2","FUTYMA Igor ",2013,"UKN LAWORTA Ustrzyki Dolne",2,52,null,null,26,null,null,26,null,null,null,null,false]
[{"$f":"IF(Zawody_2021_klas_indywidualna9[[#This Row],[Grupa]]=\"\",\"\",COUNTIF($B$3:B19,B19))","v":9},"Gr. 2","MŁYNARCZYK Maja",2010,"Niestowarzyszony",1,26,null,null,null,null,26,null,null,null,null,null,false]
[{"$f":"IF(Zawody_2021_klas_indywidualna9[[#This Row],[Grupa]]=\"\",\"\",COUNTIF($B$3:B20,B20))","v":1},"Gr. 3","LEŚNIAK Zuzanna-Maria ",2011,"KN Gondola Krynica",6,300,60,60,60,60,60,40,null,null,null,null,true]
[{"$f":"IF(Zawody_2021_klas_indywidualna9[[#This Row],[Grupa]]=\"\",\"\",COUNTIF($B$3:B21,B21))","v":2},"Gr. 3","DOMAGALSKA Aleksandra ",2012,"KN Przemyśl SKI",6,260,50,40,50,50,50,60,null,null,null,null,true]
[{"$f":"IF(Zawody_2021_klas_indywidualna9[[#This Row],[Grupa]]=\"\",\"\",COUNTIF($B$3:B22,B22))","v":3},"Gr. 3","MUCHA Zuzanna",2012,"UKN LAWORTA Ustrzyki Dolne",5,175,35,30,null,35,40,35,null,null,null,null,true]
[{"$f":"IF(Zawody_2021_klas_indywidualna9[[#This Row],[Grupa]]=\"\",\"\",COUNTIF($B$3:B23,B23))","v":4},"Gr. 3","KOCHANOWICZ Nadia ",2012,"UKN LAWORTA Ustrzyki Dolne",4,170,40,50,40,40,null,null,null,null,null,null,true]
[{"$f":"IF(Zawody_2021_klas_indywidualna9[[#This Row],[Grupa]]=\"\",\"\",COUNTIF($B$3:B24,B24))","v":5},"Gr. 3","PORĘBA Małgorzata ",2012,"UKS Gwożdzik Gwoźnica D.",2,80,null,null,30,null,null,50,null,null,null,null,true]
[{"$f":"IF(Zawody_2021_klas_indywidualna9[[#This Row],[Grupa]]=\"\",\"\",COUNTIF($B$3:B25,B25))","v":6},"Gr. 3","KOLII Myroslava ",2012,"UKS Śródmieście Przemyśl",2,65,30,null,35,null,null,null,null,null,null,null,true]
[{"$f":"IF(Zawody_2021_klas_indywidualna9[[#This Row],[Grupa]]=\"\",\"\",COUNTIF($B$3:B26,B26))","v":7},"Gr. 3","SMOTRYCKA Zuzanna ",2011,"UKS Śródmieście Przemyśl",1,35,null,35,null,null,null,null,null,null,null,null,true]
[{"$f":"IF(Zawody_2021_klas_indywidualna9[[#This Row],[Grupa]]=\"\",\"\",COUNTIF($B$3:B27,B27))","v":1},"Gr. 4","GAJDEK Tymoteusz ",2012,"UKN LAWORTA Ustrzyki Dolne",6,300,60,50,60,60,60,60,null,null,null,null,false]
[{"$f":"IF(Zawody_2021_klas_indywidualna9[[#This Row],[Grupa]]=\"\",\"\",COUNTIF($B$3:B28,B28))","v":2},"Gr. 4","MIELNIK Fabian ",2012,"KN Przemyśl SKI",6,260,50,60,30,50,50,50,null,null,null,null,false]
[{"$f":"IF(Zawody_2021_klas_indywidualna9[[#This Row],[Grupa]]=\"\",\"\",COUNTIF($B$3:B29,B29))","v":3},"Gr. 4","KOKOSZYŃSKI Franciszek ",2011,"UKN LAWORTA Ustrzyki Dolne",5,185,35,35,40,null,40,35,null,null,null,null,false]
[{"$f":"IF(Zawody_2021_klas_indywidualna9[[#This Row],[Grupa]]=\"\",\"\",COUNTIF($B$3:B30,B30))","v":4},"Gr. 4","SARNICKI Antoni ",2012,"KN Przemyśl SKI",4,170,40,40,50,null,null,40,null,null,null,null,false]
[{"$f":"IF(Zawody_2021_klas_indywidualna9[[#This Row],[Grupa]]=\"\",\"\",COUNTIF($B$3:B31,B31))","v":5},"Gr. 4","BOCER Jakub ",2012,"UKS Śródmieście Przemyśl",5,163,30,28,35,40,null,30,null,null,null,null,false]
[{"$f":"IF(Zawody_2021_klas_indywidualna9[[#This Row],[Grupa]]=\"\",\"\",COUNTIF($B$3:B32,B32))","v":6},"Gr. 4","WRONA Filip ",2012,"UKN LAWORTA Ustrzyki Dolne",2,58,28,30,null,null,null,null,null,null,null,null,false]
[{"$f":"IF(Zawody_2021_klas_indywidualna9[[#This Row],[Grupa]]=\"\",\"\",COUNTIF($B$3:B33,B33))","v":7},"Gr. 4","KUŚMIDER Jagoda ",2010,"UKN LAWORTA Ustrzyki Dolne",1,26,26,null,null,null,null,null,null,null,null,null,false]
[{"$f":"IF(Zawody_2021_klas_indywidualna9[[#This Row],[Grupa]]=\"\",\"\",COUNTIF($B$3:B34,B34))","v":1},"Gr. 5","LEŚNIAK Helena ",2009,"KN Gondola Krynica",5,300,60,60,null,60,60,60,null,null,null,null,true]
[{"$f":"IF(Zawody_2021_klas_indywidualna9[[#This Row],[Grupa]]=\"\",\"\",COUNTIF($B$3:B35,B35))","v":2},"Gr. 5","BERNAT Kaja ",2010,"KN Gondola Krynica",5,260,50,50,60,50,null,50,null,null,null,null,true]
[{"$f":"IF(Zawody_2021_klas_indywidualna9[[#This Row],[Grupa]]=\"\",\"\",COUNTIF($B$3:B36,B36))","v":3},"Gr. 5","HENDZEL Maja ",2009,"KN Przemyśl SKI",6,185,40,40,26,30,40,35,null,null,null,null,true]
[{"$f":"IF(Zawody_2021_klas_indywidualna9[[#This Row],[Grupa]]=\"\",\"\",COUNTIF($B$3:B37,B37))","v":4},"Gr. 5","DACKO Emilia ",2009,"UKN LAWORTA Ustrzyki Dolne",4,180,null,null,50,40,50,40,null,null,null,null,true]
[{"$f":"IF(Zawody_2021_klas_indywidualna9[[#This Row],[Grupa]]=\"\",\"\",COUNTIF($B$3:B38,B38))","v":5},"Gr. 5","GRĘDA Zuzanna ",2009,"KN Przemyśl SKI",6,163,30,35,35,28,35,28,null,null,null,null,true]
[{"$f":"IF(Zawody_2021_klas_indywidualna9[[#This Row],[Grupa]]=\"\",\"\",COUNTIF($B$3:B39,B39))","v":6},"Gr. 5","MACH Martyna ",2010,"KN Przemyśl SKI",5,147,35,30,28,26,28,null,null,null,null,null,true]
[{"$f":"IF(Zawody_2021_klas_indywidualna9[[#This Row],[Grupa]]=\"\",\"\",COUNTIF($B$3:B40,B40))","v":7},"Gr. 5","FUTYMA Wiktoria ",2009,"UKN LAWORTA Ustrzyki Dolne",4,110,null,null,30,24,30,26,null,null,null,null,true]
[{"$f":"IF(Zawody_2021_klas_indywidualna9[[#This Row],[Grupa]]=\"\",\"\",COUNTIF($B$3:B41,B41))","v":8},"Gr. 5","DOŁŻYCKA Lena ",2009,"UKN LAWORTA Ustrzyki Dolne",3,105,null,null,40,35,null,30,null,null,null,null,true]
[{"$f":"IF(Zawody_2021_klas_indywidualna9[[#This Row],[Grupa]]=\"\",\"\",COUNTIF($B$3:B42,B42))","v":9},"Gr. 5","NIKODY Aleksandra ",2009,"SKN Jasło przy ZSM Nr 1",4,94,null,null,24,22,24,24,null,null,null,null,true]
[{"$f":"IF(Zawody_2021_klas_indywidualna9[[#This Row],[Grupa]]=\"\",\"\",COUNTIF($B$3:B43,B43))","v":10},"Gr. 5","KULIGOWSKA Zofia ",2010,"UKS Śródmieście Przemyśl",2,56,28,28,null,null,null,null,null,null,null,null,true]
[{"$f":"IF(Zawody_2021_klas_indywidualna9[[#This Row],[Grupa]]=\"\",\"\",COUNTIF($B$3:B44,B44))","v":1},"Gr. 6","ROGALIŃSKI Stefan ",2010,"UKN LAWORTA Ustrzyki Dolne",6,270,50,40,60,35,60,60,null,null,null,null,false]
[{"$f":"IF(Zawody_2021_klas_indywidualna9[[#This Row],[Grupa]]=\"\",\"\",COUNTIF($B$3:B45,B45))","v":2},"Gr. 6","SEMP Damian ",2009,"KN Przemyśl SKI",6,270,60,50,50,60,50,50,null,null,null,null,false]
[{"$f":"IF(Zawody_2021_klas_indywidualna9[[#This Row],[Grupa]]=\"\",\"\",COUNTIF($B$3:B46,B46))","v":3},"Gr. 6","SZOPNIEWSKI Adam ",2009,"SKN Jasło przy ZSM Nr 1",5,195,35,30,null,50,40,40,null,null,null,null,false]
[{"$f":"IF(Zawody_2021_klas_indywidualna9[[#This Row],[Grupa]]=\"\",\"\",COUNTIF($B$3:B47,B47))","v":4},"Gr. 6","JANDURA Adam ",2009,"SKN Jasło przy ZSM Nr 1",6,173,28,28,35,40,35,35,null,null,null,null,false]
[{"$f":"IF(Zawody_2021_klas_indywidualna9[[#This Row],[Grupa]]=\"\",\"\",COUNTIF($B$3:B48,B48))","v":5},"Gr. 6","KUŁAK Szymon ",2009,"KN Przemyśl SKI",3,115,40,35,40,null,null,null,null,null,null,null,false]
[{"$f":"IF(Zawody_2021_klas_indywidualna9[[#This Row],[Grupa]]=\"\",\"\",COUNTIF($B$3:B49,B49))","v":6},"Gr. 6","KUTER Krzysztof ",2009,"UKN LAWORTA Ustrzyki Dolne",2,90,null,60,null,30,null,null,null,null,null,null,false]
[{"$f":"IF(Zawody_2021_klas_indywidualna9[[#This Row],[Grupa]]=\"\",\"\",COUNTIF($B$3:B50,B50))","v":7},"Gr. 6","ŁUKASIEWICZ Olek ",2009,"PTN Przemyśl",2,56,30,26,null,null,null,null,null,null,null,null,false]
[{"$f":"IF(Zawody_2021_klas_indywidualna9[[#This Row],[Grupa]]=\"\",\"\",COUNTIF($B$3:B51,B51))","v":8},"Gr. 6","WOŚ Michał",2010,"UKS Śródmieście Przemyśl",1,30,null,null,null,null,null,30,null,null,null,null,false]
[{"$f":"IF(Zawody_2021_klas_indywidualna9[[#This Row],[Grupa]]=\"\",\"\",COUNTIF($B$3:B52,B52))","v":9},"Gr. 6","WIKTORSKI Kacper",2009,"UKN LAWORTA Ustrzyki Dolne",1,28,null,null,null,null,null,28,null,null,null,null,false]
[{"$f":"IF(Zawody_2021_klas_indywidualna9[[#This Row],[Grupa]]=\"\",\"\",COUNTIF($B$3:B53,B53))","v":10},"Gr. 6","DZIURZYŃSKI Szymon ",2010,"PTN Przemyśl",1,26,26,null,null,null,null,null,null,null,null,null,false]
[{"$f":"IF(Zawody_2021_klas_indywidualna9[[#This Row],[Grupa]]=\"\",\"\",COUNTIF($B$3:B54,B54))","v":1},"Gr. 7","KĄDZIOŁKA Pola ",2007,"UKN LAWORTA Ustrzyki Dolne",6,300,60,60,60,60,60,60,null,null,null,null,true]
[{"$f":"IF(Zawody_2021_klas_indywidualna9[[#This Row],[Grupa]]=\"\",\"\",COUNTIF($B$3:B55,B55))","v":2},"Gr. 7","ELMERYCH Maria ",2008,"UKN LAWORTA Ustrzyki Dolne",5,230,40,50,null,40,50,50,null,null,null,null,true]
[{"$f":"IF(Zawody_2021_klas_indywidualna9[[#This Row],[Grupa]]=\"\",\"\",COUNTIF($B$3:B56,B56))","v":3},"Gr. 7","KOWALSKA Julia ",2008,"UKN LAWORTA Ustrzyki Dolne",6,230,50,40,50,50,40,35,null,null,null,null,true]
[{"$f":"IF(Zawody_2021_klas_indywidualna9[[#This Row],[Grupa]]=\"\",\"\",COUNTIF($B$3:B57,B57))","v":4},"Gr. 7","BAŁABAN Maria ",2007,"UKN LAWORTA Ustrzyki Dolne",6,170,30,35,40,28,35,30,null,null,null,null,true]
[{"$f":"IF(Zawody_2021_klas_indywidualna9[[#This Row],[Grupa]]=\"\",\"\",COUNTIF($B$3:B58,B58))","v":5},"Gr. 7","KOCHANOWICZ Blanka ",2008,"UKN LAWORTA Ustrzyki Dolne",6,170,35,30,35,30,30,40,null,null,null,null,true]
[{"$f":"IF(Zawody_2021_klas_indywidualna9[[#This Row],[Grupa]]=\"\",\"\",COUNTIF($B$3:B59,B59))","v":6},"Gr. 7","SOWA Nikola ",2007,"KN Przemyśl SKI",5,124,22,24,26,26,26,null,null,null,null,null,true]
[{"$f":"IF(Zawody_2021_klas_indywidualna9[[#This Row],[Grupa]]=\"\",\"\",COUNTIF($B$3:B60,B60))","v":7},"Gr. 7","STRUSIEWICZ Julia ",2007,"UKN LAWORTA Ustrzyki Dolne",4,115,26,26,28,35,null,null,null,null,null,null,true]
[{"$f":"IF(Zawody_2021_klas_indywidualna9[[#This Row],[Grupa]]=\"\",\"\",COUNTIF($B$3:B61,B61))","v":8},"Gr. 7","DZIWISZ Julia ",2008,"UKN LAWORTA Ustrzyki Dolne",3,86,28,28,30,null,null,null,null,null,null,null,true]
[{"$f":"IF(Zawody_2021_klas_indywidualna9[[#This Row],[Grupa]]=\"\",\"\",COUNTIF($B$3:B62,B62))","v":9},"Gr. 7","DACKO Pola ",2008,"UKN LAWORTA Ustrzyki Dolne",3,80,null,null,null,24,28,28,null,null,null,null,true]
[{"$f":"IF(Zawody_2021_klas_indywidualna9[[#This Row],[Grupa]]=\"\",\"\",COUNTIF($B$3:B63,B63))","v":10},"Gr. 7","KĘSICKA Lilianna ",2007,"KN Przemyśl SKI",1,24,24,null,null,null,null,null,null,null,null,null,true]
[{"$f":"IF(Zawody_2021_klas_indywidualna9[[#This Row],[Grupa]]=\"\",\"\",COUNTIF($B$3:B64,B64))","v":1},"Gr. 8","BERNAT Karol ",2007,"KN Gondola Krynica",6,300,60,60,60,60,60,60,null,null,null,null,false]
[{"$f":"IF(Zawody_2021_klas_indywidualna9[[#This Row],[Grupa]]=\"\",\"\",COUNTIF($B$3:B65,B65))","v":2},"Gr. 8","WIEJOWSKI Michał ",2008,"KN Gondola Krynica",5,230,40,40,50,50,null,50,null,null,null,null,false]
[{"$f":"IF(Zawody_2021_klas_indywidualna9[[#This Row],[Grupa]]=\"\",\"\",COUNTIF($B$3:B66,B66))","v":3},"Gr. 8","KRYDA Mikołaj ",2008,"UKN LAWORTA Ustrzyki Dolne",6,215,50,50,35,28,50,30,null,null,null,null,false]
[{"$f":"IF(Zawody_2021_klas_indywidualna9[[#This Row],[Grupa]]=\"\",\"\",COUNTIF($B$3:B67,B67))","v":4},"Gr. 8","JUCOS Piotr ",2008,"UKN LAWORTA Ustrzyki Dolne",6,185,35,35,40,40,35,35,null,null,null,null,{"$f":"IF(B67=\"\",\"\",MOD(IF(B67=B66,R66,R66+1),2)=1)","v":false}]
[{"$f":"IF(Zawody_2021_klas_indywidualna9[[#This Row],[Grupa]]=\"\",\"\",COUNTIF($B$3:B68,B68))","v":5},"Gr. 8","TŁUCZEK Kasper ",2007,"KN Przemyśl SKI",6,175,30,30,30,35,40,40,null,null,null,null,false]
[{"$f":"IF(Zawody_2021_klas_indywidualna9[[#This Row],[Grupa]]=\"\",\"\",COUNTIF($B$3:B69,B69))","v":6},"Gr. 8","BIERNACKI Kacper ",2008,"SKN Jasło przy ZSM Nr 1",5,142,28,null,28,30,28,28,null,null,null,null,false]
[{"$f":"IF(Zawody_2021_klas_indywidualna9[[#This Row],[Grupa]]=\"\",\"\",COUNTIF($B$3:B70,B70))","v":7},"Gr. 8","SMOTRYCKI Maksymilian ",2008,"KN Przemyśl SKI",1,30,null,null,null,null,30,null,null,null,null,null,false]
[{"$f":"IF(Zawody_2021_klas_indywidualna9[[#This Row],[Grupa]]=\"\",\"\",COUNTIF($B$3:B71,B71))","v":8},"Gr. 8","KOWALSKI Kamil ",2008,"UKN LAWORTA Ustrzyki Dolne",1,28,null,28,null,null,null,null,null,null,null,null,false]
[{"$f":"IF(Zawody_2021_klas_indywidualna9[[#This Row],[Grupa]]=\"\",\"\",COUNTIF($B$3:B72,B72))","v":1},"Gr. 9","WĘGLOWSKA Laura ",2005,"UKN LAWORTA Ustrzyki Dolne",3,180,null,null,null,60,60,60,null,null,null,null,true]
[{"$f":"IF(Zawody_2021_klas_indywidualna9[[#This Row],[Grupa]]=\"\",\"\",COUNTIF($B$3:B73,B73))","v":2},"Gr. 9","KUTER Katarzyna ",2005,"UKN LAWORTA Ustrzyki Dolne",1,60,null,null,60,null,null,null,null,null,null,null,true]
[{"$f":"IF(Zawody_2021_klas_indywidualna9[[#This Row],[Grupa]]=\"\",\"\",COUNTIF($B$3:B74,B74))","v":3},"Gr. 9","WOLAN Sylwia",2006,"UKS Gwożdzik Gwoźnica D.",1,50,null,null,null,null,null,50,null,null,null,null,true]
[{"$f":"IF(Zawody_2021_klas_indywidualna9[[#This Row],[Grupa]]=\"\",\"\",COUNTIF($B$3:B75,B75))","v":1},"Gr. 10","GRĘDA Jakub ",2006,"UKN LAWORTA Ustrzyki Dolne",5,280,60,50,60,60,50,null,null,null,null,null,false]
[{"$f":"IF(Zawody_2021_klas_indywidualna9[[#This Row],[Grupa]]=\"\",\"\",COUNTIF($B$3:B76,B76))","v":2},"Gr. 10","GAJDEK Filip ",2005,"UKN LAWORTA Ustrzyki Dolne",6,280,50,60,40,50,60,60,null,null,null,null,false]
[{"$f":"IF(Zawody_2021_klas_indywidualna9[[#This Row],[Grupa]]=\"\",\"\",COUNTIF($B$3:B77,B77))","v":3},"Gr. 10","SZCZEPAŃSKI Jan ",2006,"UKN LAWORTA Ustrzyki Dolne",5,210,40,40,null,40,40,50,null,null,null,null,false]
[{"$f":"IF(Zawody_2021_klas_indywidualna9[[#This Row],[Grupa]]=\"\",\"\",COUNTIF($B$3:B78,B78))","v":4},"Gr. 10","FISCHER Rafał ",2006,"UKN LAWORTA Ustrzyki Dolne",5,185,30,null,50,30,35,40,null,null,null,null,false]
[{"$f":"IF(Zawody_2021_klas_indywidualna9[[#This Row],[Grupa]]=\"\",\"\",COUNTIF($B$3:B79,B79))","v":5},"Gr. 10","DAROSZ Kacper ",2005,"UKN LAWORTA Ustrzyki Dolne",4,140,35,35,35,35,null,null,null,null,null,null,false]
[{"$f":"IF(Zawody_2021_klas_indywidualna9[[#This Row],[Grupa]]=\"\",\"\",COUNTIF($B$3:B80,B80))","v":6},"Gr. 10","PIĘKOŚ Jakub ",2005,"SKN Jasło przy ZSM Nr 1",4,114,26,28,null,null,30,30,null,null,null,null,false]
[{"$f":"IF(Zawody_2021_klas_indywidualna9[[#This Row],[Grupa]]=\"\",\"\",COUNTIF($B$3:B81,B81))","v":7},"Gr. 10","SZOPNIEWSKI Kamil ",2005,"SKN Jasło przy ZSM Nr 1",2,63,null,null,null,null,28,35,null,null,null,null,false]
[{"$f":"IF(Zawody_2021_klas_indywidualna9[[#This Row],[Grupa]]=\"\",\"\",COUNTIF($B$3:B82,B82))","v":8},"Gr. 10","WITKA Jakub ",2006,"UKN LAWORTA Ustrzyki Dolne",2,58,28,30,null,null,null,null,null,null,null,null,false]
[{"$f":"IF(Zawody_2021_klas_indywidualna9[[#This Row],[Grupa]]=\"\",\"\",COUNTIF($B$3:B83,B83))","v":9},"Gr. 10","DROZD Sebastian ",2006,"UKS Gwożdzik Gwoźnica D.",1,28,null,null,null,28,null,null,null,null,null,null,false]
[{"$f":"IF(Zawody_2021_klas_indywidualna9[[#This Row],[Grupa]]=\"\",\"\",COUNTIF($B$3:B84,B84))","v":1},"Gr. 11","KĄDZIOŁKA Oliwia ",2003,"UKN LAWORTA Ustrzyki Dolne",6,300,60,60,60,60,60,60,null,null,null,null,true]
[{"$f":"IF(Zawody_2021_klas_indywidualna9[[#This Row],[Grupa]]=\"\",\"\",COUNTIF($B$3:B85,B85))","v":2},"Gr. 11","GAWLIK Jagoda ",2003,"UKN LAWORTA Ustrzyki Dolne",6,250,50,50,50,50,50,50,null,null,null,null,true]
[{"$f":"IF(Zawody_2021_klas_indywidualna9[[#This Row],[Grupa]]=\"\",\"\",COUNTIF($B$3:B86,B86))","v":1},"Gr. 12","OSIADACZ Brian ",2004,"UKN LAWORTA Ustrzyki Dolne",6,280,50,60,50,60,50,60,null,null,null,null,false]
[{"$f":"IF(Zawody_2021_klas_indywidualna9[[#This Row],[Grupa]]=\"\",\"\",COUNTIF($B$3:B87,B87))","v":2},"Gr. 12","BABIARZ Dawid ",2002,"UKN LAWORTA Ustrzyki Dolne",4,230,60,null,60,null,60,50,null,null,null,null,false]
[{"$f":"IF(Zawody_2021_klas_indywidualna9[[#This Row],[Grupa]]=\"\",\"\",COUNTIF($B$3:B88,B88))","v":3},"Gr. 12","DROZD Krystian ",2003,"UKS Gwożdzik Gwoźnica D.",4,170,null,null,40,50,40,40,null,null,null,null,false]
[{"$f":"IF(Zawody_2021_klas_indywidualna9[[#This Row],[Grupa]]=\"\",\"\",COUNTIF($B$3:B89,B89))","v":4},"Gr. 12","WOLAN Mateusz ",2003,"UKS Gwożdzik Gwoźnica D.",4,145,null,null,35,40,35,35,null,null,null,null,false]
[{"$f":"IF(Zawody_2021_klas_indywidualna9[[#This Row],[Grupa]]=\"\",\"\",COUNTIF($B$3:B90,B90))","v":5},"Gr. 12","SOŁTYS Mateusz ",2002,"UKS Gwożdzik Gwoźnica D.",1,35,null,null,null,35,null,null,null,null,null,null,false]
[{"$f":"IF(Zawody_2021_klas_indywidualna9[[#This Row],[Grupa]]=\"\",\"\",COUNTIF($B$3:B91,B91))","v":6},"Gr. 12","ANTOŃ Kamil",2003,"UKS Gwożdzik Gwoźnica D.",1,30,null,null,null,null,30,null,null,null,null,null,false]
[{"$f":"IF(Zawody_2021_klas_indywidualna9[[#This Row],[Grupa]]=\"\",\"\",COUNTIF($B$3:B92,B92))","v":1},"Gr. 13","KULIGOWSKA Oliwia ",1996,"KN Przemyśl SKI",2,120,60,60,null,null,null,null,null,null,null,null,true]
[{"$f":"IF(Zawody_2021_klas_indywidualna9[[#This Row],[Grupa]]=\"\",\"\",COUNTIF($B$3:B93,B93))","v":2},"Gr. 13","DYDEK Aleksandra",1988,"UKS Gwożdzik Gwoźnica D.",1,60,null,null,null,null,60,null,null,null,null,null,true]
[{"$f":"IF(Zawody_2021_klas_indywidualna9[[#This Row],[Grupa]]=\"\",\"\",COUNTIF($B$3:B94,B94))","v":1},"Gr. 14","PIĘCIAK Konrad",1988,"UKS Gwożdzik Gwoźnica D.",3,135,null,null,null,60,40,35,null,null,null,null,false]
[{"$f":"IF(Zawody_2021_klas_indywidualna9[[#This Row],[Grupa]]=\"\",\"\",COUNTIF($B$3:B95,B95))","v":2},"Gr. 14","SMOLARZ Przemysław",1999,"UKS Gwożdzik Gwoźnica D.",2,90,null,null,null,null,50,40,null,null,null,null,false]
[{"$f":"IF(Zawody_2021_klas_indywidualna9[[#This Row],[Grupa]]=\"\",\"\",COUNTIF($B$3:B96,B96))","v":3},"Gr. 14","BROŻEK Łukasz",1993,"UKS Gwożdzik Gwoźnica D.",1,60,null,null,null,null,60,null,null,null,null,null,false]
[{"$f":"IF(Zawody_2021_klas_indywidualna9[[#This Row],[Grupa]]=\"\",\"\",COUNTIF($B$3:B97,B97))","v":4},"Gr. 14","NOWAK Michał",1993,"UKN LAWORTA Ustrzyki Dolne",1,60,null,null,null,null,null,60,null,null,null,null,false]
[{"$f":"IF(Zawody_2021_klas_indywidualna9[[#This Row],[Grupa]]=\"\",\"\",COUNTIF($B$3:B98,B98))","v":5},"Gr. 14","OSTROWSKI Tomasz",1983,"UKN LAWORTA Ustrzyki Dolne",1,50,null,null,null,null,null,50,null,null,null,null,false]
[{"$f":"IF(Zawody_2021_klas_indywidualna9[[#This Row],[Grupa]]=\"\",\"\",COUNTIF($B$3:B99,B99))","v":1},"Gr. 16","ELMERYCH Paweł ",1975,"UKN LAWORTA Ustrzyki Dolne",6,300,60,60,60,60,60,60,null,null,null,null,true]
[{"$f":"IF(Zawody_2021_klas_indywidualna9[[#This Row],[Grupa]]=\"\",\"\",COUNTIF($B$3:B100,B100))","v":2},"Gr. 16","PROBULSKI Zbigniew ",1953,"Magura Gorlice",4,200,null,null,50,50,50,50,null,null,null,null,true]
[{"$f":"IF(Zawody_2021_klas_indywidualna9[[#This Row],[Grupa]]=\"\",\"\",COUNTIF($B$3:B101,B101))","v":3},"Gr. 16","BABIARZ Wacław ",1969,"UKN LAWORTA Ustrzyki Dolne",6,200,50,40,40,40,30,26,null,null,null,null,true]
[{"$f":"IF(Zawody_2021_klas_indywidualna9[[#This Row],[Grupa]]=\"\",\"\",COUNTIF($B$3:B102,B102))","v":4},"Gr. 16","WÓJCIK Tadeusz ",1950,"SKN Jasło przy ZSM Nr 1",6,171,40,35,35,35,26,24,null,null,null,null,true]
[{"$f":"IF(Zawody_2021_klas_indywidualna9[[#This Row],[Grupa]]=\"\",\"\",COUNTIF($B$3:B103,B103))","v":5},"Gr. 16","GUDZELAK Józef ",1948,"KN Przemyśl SKI",2,85,35,50,null,null,null,null,null,null,null,null,true]
[{"$f":"IF(Zawody_2021_klas_indywidualna9[[#This Row],[Grupa]]=\"\",\"\",COUNTIF($B$3:B104,B104))","v":6},"Gr. 16","CZELNY Janusz",1964,"Niestowarzyszony",2,80,null,null,null,null,40,40,null,null,null,null,true]
[{"$f":"IF(Zawody_2021_klas_indywidualna9[[#This Row],[Grupa]]=\"\",\"\",COUNTIF($B$3:B105,B105))","v":7},"Gr. 16","BOBKO Zygmunt ",1956,"KN Przemyśl SKI",2,65,null,null,null,null,35,30,null,null,null,null,true]
[{"$f":"IF(Zawody_2021_klas_indywidualna9[[#This Row],[Grupa]]=\"\",\"\",COUNTIF($B$3:B106,B106))","v":8},"Gr. 16","PORĘBA Adam ",1971,"UKS Gwożdzik Gwoźnica D.",2,52,null,null,30,null,null,22,null,null,null,null,true]
[{"$f":"IF(Zawody_2021_klas_indywidualna9[[#This Row],[Grupa]]=\"\",\"\",COUNTIF($B$3:B107,B107))","v":9},"Gr. 16","PIĘKOŚ ANDRZEJ",1962,"SKN Jasło przy ZSM Nr 1",1,35,null,null,null,null,null,35,null,null,null,null,true]
[{"$f":"IF(Zawody_2021_klas_indywidualna9[[#This Row],[Grupa]]=\"\",\"\",COUNTIF($B$3:B108,B108))","v":10},"Gr. 16","SZOPNIEWSKI Daniel ",1977,"SKN Jasło przy ZSM Nr 1",1,30,null,null,null,30,null,null,null,null,null,null,true]
[{"$f":"IF(Zawody_2021_klas_indywidualna9[[#This Row],[Grupa]]=\"\",\"\",COUNTIF($B$3:B109,B109))","v":11},"Gr. 16","KOZA Maciej",1974,"Niestowarzyszony",1,28,null,null,null,null,null,28,null,null,null,null,true]
[{"$f":"IF(Zawody_2021_klas_indywidualna9[[#This Row],[Grupa]]=\"\",\"\",COUNTIF($B$3:B110,B110))","v":12},"Gr. 16","STACHÓW Stanisław",1949,"UKS Śródmieście Przemyśl",1,28,null,null,null,null,28,null,null,null,null,null,{"$f":"IF(#REF!=\"\",\"\",MOD(IF(#REF!=B109,R109,R109+1),2)=1)","v":{"$error":"#REF!"}}]
[null,null,null,null,null,null,null,null,null,null,null,null,null,null,null,null,null,{"$f":"IF(#REF!=\"\",\"\",MOD(IF(#REF!=#REF!,R110,R110+1),2)=1)","v":{"$error":"#REF!"}}]
[null,null,null,null,null,null,null,null,null,null,null,null,null,null,null,null,null,{"$f":"IF(B110=\"\",\"\",MOD(IF(B110=#REF!,R111,R111+1),2)=1)","v":{"$error":"#REF!"}},{"$f":"IF(B110=\"\",\"\",MOD(IF(B110=#REF!,R111,R111+1),2)=1)","v":{"$error":"#REF!"}}]
[{"$f":"COUNT(Zawody_2021_klas_indywidualna9[M-ce])","v":108},null,null,null,null,null,null,null,null,null,null,null,null,null,null,null,null,null,{"$f":"IF(B111=\"\",\"\",MOD(IF(B111=B110,S112,S112+1),2)=1)","v":""}]

{"sheet":"baza","index":1,"n_rows":257,"n_cols":17,"rows_kept":257,"cut":false,"hidden":false,"merged":[]}
[11,null,null,null,null,null,null,null,null,null,null,{"$f":"IFERROR(INDEX(G$4:G$100,$A1-3),\"\")","v":0}]
[{"$f":"IFERROR(INDEX(A$4:A$100,$A1-3),\"\")","v":70},{"$f":"IFERROR(INDEX(B$4:B$100,$A1-3),\"\")","v":2},{"$f":"IFERROR(INDEX(C$4:C$100,$A1-3),\"\")","v":"SZCZEPAŃSKI Jan "},{"$f":"IFERROR(INDEX(D$4:D$100,$A1-3),\"\")","v":2006},"UKN LAWORTA Ustrzyki Dolne","Gr. 10",{"$f":"IF(L1=\"x\",\"tak\",\"nie\")","v":"nie"},{"$f":"IFERROR(INDEX(H$4:H$100,$A1-3),\"\")","v":""}]
["Lp.","M-ce","NAZWISKO i Imię","rok ur.","Klub","grupa","dodaj \"x\"","dodani",null,null,null,"M-ce","NAZWISKO i Imię","rok ur.","Klub","grupa","Kolumna1"]
[1,1,"LEŚNIAK Zofia-Katarzyna ",2013,"KN Gondola Krynica","Gr. 1",null,{"$f":"IF(G4=\"\",\"\",COUNTIF(G$4:G4,G4))","v":""},null,null,null,{"$f":"IF(Q4=\"\",\"\",SUBTOTAL(103,Q$4:Q4))","v":1},{"$f":"IF($Q4=\"\",\"\",INDEX(zawodniki,SMALL(IF(numerki=$Q4,ROW(numerki)-ROW(H$4)+1),COUNTIF($Q$4:$Q4,$Q4)),COLUMNS($B$8:B8)))","v":"GAJDEK Tymoteusz "},{"$f":"IF($Q4=\"\",\"\",INDEX(zawodniki,SMALL(IF(numerki=$Q4,ROW(numerki)-ROW(I$4)+1),COUNTIF($Q$4:$Q4,$Q4)),COLUMNS($B$8:C8)))","v":2012},{"$f":"IF($Q4=\"\",\"\",INDEX(zawodniki,SMALL(IF(numerki=$Q4,ROW(numerki)-ROW(J$4)+1),COUNTIF($Q$4:$Q4,$Q4)),COLUMNS($B$8:D8)))","v":"UKN LAWORTA Ustrzyki Dolne"},{"$f":"IF($Q4=\"\",\"\",INDEX(zawodniki,SMALL(IF(numerki=$Q4,ROW(numerki)-ROW(K$4)+1),COUNTIF($Q$4:$Q4,$Q4)),COLUMNS($B$8:E8)))","v":"Gr. 16"},{"$f":"IF(ROWS($L$144:L144)>COUNT(numerki),\"\",SMALL(numerki,ROWS($L$144:L144)))","v":1}]
[6,2,"SZUKALSKI Patryk ",2013,"UKN LAWORTA Ustrzyki Dolne","Gr. 1",null,{"$f":"IF(G5=\"\",\"\",COUNTIF(G$4:G5,G5))","v":""},null,null,null,{"$f":"IF(Q5=\"\",\"\",SUBTOTAL(103,Q$4:Q5))","v":2},{"$f":"IF($Q5=\"\",\"\",INDEX(zawodniki,SMALL(IF(numerki=$Q5,ROW(numerki)-ROW(H$4)+1),COUNTIF($Q$4:$Q5,$Q5)),COLUMNS($B$8:B9)))","v":"GAJDEK Maksymilian "},{"$f":"IF($Q5=\"\",\"\",INDEX(zawodniki,SMALL(IF(numerki=$Q5,ROW(numerki)-ROW(I$4)+1),COUNTIF($Q$4:$Q5,$Q5)),COLUMNS($B$8:C9)))","v":2014},{"$f":"IF($Q5=\"\",\"\",INDEX(zawodniki,SMALL(IF(numerki=$Q5,ROW(numerki)-ROW(J$4)+1),COUNTIF($Q$4:$Q5,$Q5)),COLUMNS($B$8:D9)))","v":"UKN LAWORTA Ustrzyki Dolne"},{"$f":"IF($Q5=\"\",\"\",INDEX(zawodniki,SMALL(IF(numerki=$Q5,ROW(numerki)-ROW(K$4)+1),COUNTIF($Q$4:$Q5,$Q5)),COLUMNS($B$8:E9)))","v":"Gr. 2"},{"$f":"IF(ROWS($L$144:L145)>COUNT(numerki),\"\",SMALL(numerki,ROWS($L$144:L145)))","v":2}]
[7,3,"KULIGOWSKI Jerzy ",2013,"UKS Śródmieście Przemyśl","Gr. 1",null,{"$f":"IF(G6=\"\",\"\",COUNTIF(G$4:G6,G6))","v":""},null,null,null,{"$f":"IF(Q6=\"\",\"\",SUBTOTAL(103,Q$4:Q6))","v":3},{"$f":"IF($Q6=\"\",\"\",INDEX(zawodniki,SMALL(IF(numerki=$Q6,ROW(numerki)-ROW(H$4)+1),COUNTIF($Q$4:$Q6,$Q6)),COLUMNS($B$8:B10)))","v":"WĘGLOWSKA Laura "},{"$f":"IF($Q6=\"\",\"\",INDEX(zawodniki,SMALL(IF(numerki=$Q6,ROW(numerki)-ROW(I$4)+1),COUNTIF($Q$4:$Q6,$Q6)),COLUMNS($B$8:C10)))","v":2005},{"$f":"IF($Q6=\"\",\"\",INDEX(zawodniki,SMALL(IF(numerki=$Q6,ROW(numerki)-ROW(J$4)+1),COUNTIF($Q$4:$Q6,$Q6)),COLUMNS($B$8:D10)))","v":"UKN LAWORTA Ustrzyki Dolne"},{"$f":"IF($Q6=\"\",\"\",INDEX(zawodniki,SMALL(IF(numerki=$Q6,ROW(numerki)-ROW(K$4)+1),COUNTIF($Q$4:$Q6,$Q6)),COLUMNS($B$8:E10)))","v":"Gr. 8"},{"$f":"IF(ROWS($L$144:L146)>COUNT(numerki),\"\",SMALL(numerki,ROWS($L$144:L146)))","v":3}]
[33,4,"MACH Martyna ",2010,"KN Przemyśl SKI","Gr. 1",null,{"$f":"IF(G7=\"\",\"\",COUNTIF(G$4:G7,G7))","v":""},null,null,null,{"$f":"IF(Q7=\"\",\"\",SUBTOTAL(103,Q$4:Q7))","v":4},{"$f":"IF($Q7=\"\",\"\",INDEX(zawodniki,SMALL(IF(numerki=$Q7,ROW(numerki)-ROW(H$4)+1),COUNTIF($Q$4:$Q7,$Q7)),COLUMNS($B$8:B11)))","v":"GAJDEK Filip "},{"$f":"IF($Q7=\"\",\"\",INDEX(zawodniki,SMALL(IF(numerki=$Q7,ROW(numerki)-ROW(I$4)+1),COUNTIF($Q$4:$Q7,$Q7)),COLUMNS($B$8:C11)))","v":2005},{"$f":"IF($Q7=\"\",\"\",INDEX(zawodniki,SMALL(IF(numerki=$Q7,ROW(numerki)-ROW(J$4)+1),COUNTIF($Q$4:$Q7,$Q7)),COLUMNS($B$8:D11)))","v":"UKN LAWORTA Ustrzyki Dolne"},{"$f":"IF($Q7=\"\",\"\",INDEX(zawodniki,SMALL(IF(numerki=$Q7,ROW(numerki)-ROW(K$4)+1),COUNTIF($Q$4:$Q7,$Q7)),COLUMNS($B$8:E11)))","v":"Gr. 9"},{"$f":"IF(ROWS($L$144:L147)>COUNT(numerki),\"\",SMALL(numerki,ROWS($L$144:L147)))","v":4}]
[34,5,"DACKO Emilia ",2009,"UKN LAWORTA Ustrzyki Dolne","Gr. 1",null,{"$f":"IF(G8=\"\",\"\",COUNTIF(G$4:G8,G8))","v":""},null,null,null,{"$f":"IF(Q8=\"\",\"\",SUBTOTAL(103,Q$4:Q8))","v":""},{"$f":"IF($Q8=\"\",\"\",INDEX(zawodniki,SMALL(IF(numerki=$Q8,ROW(numerki)-ROW(H$4)+1),COUNTIF($Q$4:$Q8,$Q8)),COLUMNS($B$8:B12)))","v":""},{"$f":"IF($Q8=\"\",\"\",INDEX(zawodniki,SMALL(IF(numerki=$Q8,ROW(numerki)-ROW(I$4)+1),COUNTIF($Q$4:$Q8,$Q8)),COLUMNS($B$8:C12)))","v":""},{"$f":"IF($Q8=\"\",\"\",INDEX(zawodniki,SMALL(IF(numerki=$Q8,ROW(numerki)-ROW(J$4)+1),COUNTIF($Q$4:$Q8,$Q8)),COLUMNS($B$8:D12)))","v":""},{"$f":"IF($Q8=\"\",\"\",INDEX(zawodniki,SMALL(IF(numerki=$Q8,ROW(numerki)-ROW(K$4)+1),COUNTIF($Q$4:$Q8,$Q8)),COLUMNS($B$8:E12)))","v":""},{"$f":"IF(ROWS($L$144:L148)>COUNT(numerki),\"\",SMALL(numerki,ROWS($L$144:L148)))","v":""}]
[30,7,"HENDZEL Maja ",2009,"KN Przemyśl SKI","Gr. 10",null,{"$f":"IF(G9=\"\",\"\",COUNTIF(G$4:G9,G9))","v":""},null,null,null,{"$f":"IF(Q9=\"\",\"\",SUBTOTAL(103,Q$4:Q9))","v":""},{"$f":"IF($Q9=\"\",\"\",INDEX(zawodniki,SMALL(IF(numerki=$Q9,ROW(numerki)-ROW(H$4)+1),COUNTIF($Q$4:$Q131,$Q9)),COLUMNS($B$8:B13)))","v":""},{"$f":"IF($Q9=\"\",\"\",INDEX(zawodniki,SMALL(IF(numerki=$Q9,ROW(numerki)-ROW(I$4)+1),COUNTIF($Q$4:$Q131,$Q9)),COLUMNS($B$8:C13)))","v":""},{"$f":"IF($Q9=\"\",\"\",INDEX(zawodniki,SMALL(IF(numerki=$Q9,ROW(numerki)-ROW(J$4)+1),COUNTIF($Q$4:$Q131,$Q9)),COLUMNS($B$8:D13)))","v":""},{"$f":"IF($Q9=\"\",\"\",INDEX(zawodniki,SMALL(IF(numerki=$Q9,ROW(numerki)-ROW(K$4)+1),COUNTIF($Q$4:$Q131,$Q9)),COLUMNS($B$8:E13)))","v":""},{"$f":"IF(ROWS($L$144:L149)>COUNT(numerki),\"\",SMALL(numerki,ROWS($L$144:L149)))","v":""}]
[69,1,"DAROSZ Kacper ",2005,"UKN LAWORTA Ustrzyki Dolne","Gr. 10",null,{"$f":"IF(G10=\"\",\"\",COUNTIF(G$4:G10,G10))","v":""},null,null,null,{"$f":"IF(Q10=\"\",\"\",SUBTOTAL(103,Q$4:Q10))","v":""},{"$f":"IF($Q10=\"\",\"\",INDEX(zawodniki,SMALL(IF(numerki=$Q10,ROW(numerki)-ROW(H$4)+1),COUNTIF($Q$4:$Q10,$Q10)),COLUMNS($B$8:B14)))","v":""},{"$f":"IF($Q10=\"\",\"\",INDEX(zawodniki,SMALL(IF(numerki=$Q10,ROW(numerki)-ROW(I$4)+1),COUNTIF($Q$4:$Q10,$Q10)),COLUMNS($B$8:C14)))","v":""},{"$f":"IF($Q10=\"\",\"\",INDEX(zawodniki,SMALL(IF(numerki=$Q10,ROW(numerki)-ROW(J$4)+1),COUNTIF($Q$4:$Q10,$Q10)),COLUMNS($B$8:D14)))","v":""},{"$f":"IF($Q10=\"\",\"\",INDEX(zawodniki,SMALL(IF(numerki=$Q10,ROW(numerki)-ROW(K$4)+1),COUNTIF($Q$4:$Q10,$Q10)),COLUMNS($B$8:E14)))","v":""},{"$f":"IF(ROWS($L$144:L150)>COUNT(numerki),\"\",SMALL(numerki,ROWS($L$144:L150)))","v":""}]
[70,2,"SZCZEPAŃSKI Jan ",2006,"UKN LAWORTA Ustrzyki Dolne","Gr. 10",null,{"$f":"IF(G11=\"\",\"\",COUNTIF(G$4:G11,G11))","v":""},null,null,null,{"$f":"IF(Q11=\"\",\"\",SUBTOTAL(103,Q$4:Q11))","v":""},{"$f":"IF($Q11=\"\",\"\",INDEX(zawodniki,SMALL(IF(numerki=$Q11,ROW(numerki)-ROW(H$4)+1),COUNTIF($Q$4:$Q11,$Q11)),COLUMNS($B$8:B15)))","v":""},{"$f":"IF($Q11=\"\",\"\",INDEX(zawodniki,SMALL(IF(numerki=$Q11,ROW(numerki)-ROW(I$4)+1),COUNTIF($Q$4:$Q11,$Q11)),COLUMNS($B$8:C15)))","v":""},{"$f":"IF($Q11=\"\",\"\",INDEX(zawodniki,SMALL(IF(numerki=$Q11,ROW(numerki)-ROW(J$4)+1),COUNTIF($Q$4:$Q11,$Q11)),COLUMNS($B$8:D15)))","v":""},{"$f":"IF($Q11=\"\",\"\",INDEX(zawodniki,SMALL(IF(numerki=$Q11,ROW(numerki)-ROW(K$4)+1),COUNTIF($Q$4:$Q11,$Q11)),COLUMNS($B$8:E15)))","v":""},{"$f":"IF(ROWS($L$144:L151)>COUNT(numerki),\"\",SMALL(numerki,ROWS($L$144:L151)))","v":""}]
[71,3,"FISCHER Rafał ",2006,"UKN LAWORTA Ustrzyki Dolne","Gr. 10",null,{"$f":"IF(G12=\"\",\"\",COUNTIF(G$4:G12,G12))","v":""},null,null,null,{"$f":"IF(Q12=\"\",\"\",SUBTOTAL(103,Q$4:Q12))","v":""},{"$f":"IF($Q12=\"\",\"\",INDEX(zawodniki,SMALL(IF(numerki=$Q12,ROW(numerki)-ROW(H$4)+1),COUNTIF($Q$4:$Q12,$Q12)),COLUMNS($B$8:B16)))","v":""},{"$f":"IF($Q12=\"\",\"\",INDEX(zawodniki,SMALL(IF(numerki=$Q12,ROW(numerki)-ROW(I$4)+1),COUNTIF($Q$4:$Q12,$Q12)),COLUMNS($B$8:C16)))","v":""},{"$f":"IF($Q12=\"\",\"\",INDEX(zawodniki,SMALL(IF(numerki=$Q12,ROW(numerki)-ROW(J$4)+1),COUNTIF($Q$4:$Q12,$Q12)),COLUMNS($B$8:D16)))","v":""},{"$f":"IF($Q12=\"\",\"\",INDEX(zawodniki,SMALL(IF(numerki=$Q12,ROW(numerki)-ROW(K$4)+1),COUNTIF($Q$4:$Q12,$Q12)),COLUMNS($B$8:E16)))","v":""},{"$f":"IF(ROWS($L$144:L152)>COUNT(numerki),\"\",SMALL(numerki,ROWS($L$144:L152)))","v":""}]
[72,4,"WITKA Jakub ",2005,"UKN LAWORTA Ustrzyki Dolne","Gr. 10",null,{"$f":"IF(G13=\"\",\"\",COUNTIF(G$4:G13,G13))","v":""},null,null,null,{"$f":"IF(Q13=\"\",\"\",SUBTOTAL(103,Q$4:Q13))","v":""},{"$f":"IF($Q13=\"\",\"\",INDEX(zawodniki,SMALL(IF(numerki=$Q13,ROW(numerki)-ROW(H$4)+1),COUNTIF($Q$4:$Q13,$Q13)),COLUMNS($B$8:B17)))","v":""},{"$f":"IF($Q13=\"\",\"\",INDEX(zawodniki,SMALL(IF(numerki=$Q13,ROW(numerki)-ROW(I$4)+1),COUNTIF($Q$4:$Q13,$Q13)),COLUMNS($B$8:C17)))","v":""},{"$f":"IF($Q13=\"\",\"\",INDEX(zawodniki,SMALL(IF(numerki=$Q13,ROW(numerki)-ROW(J$4)+1),COUNTIF($Q$4:$Q13,$Q13)),COLUMNS($B$8:D17)))","v":""},{"$f":"IF($Q13=\"\",\"\",INDEX(zawodniki,SMALL(IF(numerki=$Q13,ROW(numerki)-ROW(K$4)+1),COUNTIF($Q$4:$Q13,$Q13)),COLUMNS($B$8:E17)))","v":""},{"$f":"IF(ROWS($L$144:L153)>COUNT(numerki),\"\",SMALL(numerki,ROWS($L$144:L153)))","v":""}]
[73,5,"PIEŃKOŚ Jakub ",2005,"SKN Jasło przy ZSM Nr 1","Gr. 10",null,{"$f":"IF(G14=\"\",\"\",COUNTIF(G$4:G14,G14))","v":""},null,null,null,{"$f":"IF(Q14=\"\",\"\",SUBTOTAL(103,Q$4:Q14))","v":""},{"$f":"IF($Q14=\"\",\"\",INDEX(zawodniki,SMALL(IF(numerki=$Q14,ROW(numerki)-ROW(H$4)+1),COUNTIF($Q$4:$Q14,$Q14)),COLUMNS($B$8:B18)))","v":""},{"$f":"IF($Q14=\"\",\"\",INDEX(zawodniki,SMALL(IF(numerki=$Q14,ROW(numerki)-ROW(I$4)+1),COUNTIF($Q$4:$Q14,$Q14)),COLUMNS($B$8:C18)))","v":""},{"$f":"IF($Q14=\"\",\"\",INDEX(zawodniki,SMALL(IF(numerki=$Q14,ROW(numerki)-ROW(J$4)+1),COUNTIF($Q$4:$Q14,$Q14)),COLUMNS($B$8:D18)))","v":""},{"$f":"IF($Q14=\"\",\"\",INDEX(zawodniki,SMALL(IF(numerki=$Q14,ROW(numerki)-ROW(K$4)+1),COUNTIF($Q$4:$Q14,$Q14)),COLUMNS($B$8:E18)))","v":""},{"$f":"IF(ROWS($L$144:L154)>COUNT(numerki),\"\",SMALL(numerki,ROWS($L$144:L154)))","v":""}]
[74,6,"DROZD Sebastian ",2006,"UKS Gwożdzik Gwoźnica D.","Gr. 10",null,{"$f":"IF(G15=\"\",\"\",COUNTIF(G$4:G15,G15))","v":""},null,null,null,{"$f":"IF(Q15=\"\",\"\",SUBTOTAL(103,Q$4:Q15))","v":""},{"$f":"IF($Q15=\"\",\"\",INDEX(zawodniki,SMALL(IF(numerki=$Q15,ROW(numerki)-ROW(H$4)+1),COUNTIF($Q$4:$Q15,$Q15)),COLUMNS($B$8:B19)))","v":""},{"$f":"IF($Q15=\"\",\"\",INDEX(zawodniki,SMALL(IF(numerki=$Q15,ROW(numerki)-ROW(I$4)+1),COUNTIF($Q$4:$Q15,$Q15)),COLUMNS($B$8:C19)))","v":""},{"$f":"IF($Q15=\"\",\"\",INDEX(zawodniki,SMALL(IF(numerki=$Q15,ROW(numerki)-ROW(J$4)+1),COUNTIF($Q$4:$Q15,$Q15)),COLUMNS($B$8:D19)))","v":""},{"$f":"IF($Q15=\"\",\"\",INDEX(zawodniki,SMALL(IF(numerki=$Q15,ROW(numerki)-ROW(K$4)+1),COUNTIF($Q$4:$Q15,$Q15)),COLUMNS($B$8:E19)))","v":""},{"$f":"IF(ROWS($L$144:L155)>COUNT(numerki),\"\",SMALL(numerki,ROWS($L$144:L155)))","v":""}]
[82,8,"KULIGOWSKA Oliwia ",1996,"KN Przemyśl SKI","Gr. 10",null,{"$f":"IF(G16=\"\",\"\",COUNTIF(G$4:G16,G16))","v":""},null,null,null,{"$f":"IF(Q16=\"\",\"\",SUBTOTAL(103,Q$4:Q16))","v":""},{"$f":"IF($Q16=\"\",\"\",INDEX(zawodniki,SMALL(IF(numerki=$Q16,ROW(numerki)-ROW(H$4)+1),COUNTIF($Q$4:$Q16,$Q16)),COLUMNS($B$8:B20)))","v":""},{"$f":"IF($Q16=\"\",\"\",INDEX(zawodniki,SMALL(IF(numerki=$Q16,ROW(numerki)-ROW(I$4)+1),COUNTIF($Q$4:$Q16,$Q16)),COLUMNS($B$8:C20)))","v":""},{"$f":"IF($Q16=\"\",\"\",INDEX(zawodniki,SMALL(IF(numerki=$Q16,ROW(numerki)-ROW(J$4)+1),COUNTIF($Q$4:$Q16,$Q16)),COLUMNS($B$8:D20)))","v":""},{"$f":"IF($Q16=\"\",\"\",INDEX(zawodniki,SMALL(IF(numerki=$Q16,ROW(numerki)-ROW(K$4)+1),COUNTIF($Q$4:$Q16,$Q16)),COLUMNS($B$8:E20)))","v":""},{"$f":"IF(ROWS($L$144:L156)>COUNT(numerki),\"\",SMALL(numerki,ROWS($L$144:L156)))","v":""}]
[75,1,"KĄDZIOŁKA Oliwia ",2003,"UKN LAWORTA Ustrzyki Dolne","Gr. 11",null,{"$f":"IF(G17=\"\",\"\",COUNTIF(G$4:G17,G17))","v":""},null,null,null,{"$f":"IF(Q17=\"\",\"\",SUBTOTAL(103,Q$4:Q17))","v":""},{"$f":"IF($Q17=\"\",\"\",INDEX(zawodniki,SMALL(IF(numerki=$Q17,ROW(numerki)-ROW(H$4)+1),COUNTIF($Q$4:$Q17,$Q17)),COLUMNS($B$8:B21)))","v":""},{"$f":"IF($Q17=\"\",\"\",INDEX(zawodniki,SMALL(IF(numerki=$Q17,ROW(numerki)-ROW(I$4)+1),COUNTIF($Q$4:$Q17,$Q17)),COLUMNS($B$8:C21)))","v":""},{"$f":"IF($Q17=\"\",\"\",INDEX(zawodniki,SMALL(IF(numerki=$Q17,ROW(numerki)-ROW(J$4)+1),COUNTIF($Q$4:$Q17,$Q17)),COLUMNS($B$8:D21)))","v":""},{"$f":"IF($Q17=\"\",\"\",INDEX(zawodniki,SMALL(IF(numerki=$Q17,ROW(numerki)-ROW(K$4)+1),COUNTIF($Q$4:$Q17,$Q17)),COLUMNS($B$8:E21)))","v":""},{"$f":"IF(ROWS($L$144:L157)>COUNT(numerki),\"\",SMALL(numerki,ROWS($L$144:L157)))","v":""}]
[76,2,"GAWLIK Jagoda ",2003,"UKN LAWORTA Ustrzyki Dolne","Gr. 11",null,{"$f":"IF(G18=\"\",\"\",COUNTIF(G$4:G18,G18))","v":""},null,null,null,{"$f":"IF(Q18=\"\",\"\",SUBTOTAL(103,Q$4:Q18))","v":""},{"$f":"IF($Q18=\"\",\"\",INDEX(zawodniki,SMALL(IF(numerki=$Q18,ROW(numerki)-ROW(H$4)+1),COUNTIF($Q$4:$Q18,$Q18)),COLUMNS($B$8:B22)))","v":""},{"$f":"IF($Q18=\"\",\"\",INDEX(zawodniki,SMALL(IF(numerki=$Q18,ROW(numerki)-ROW(I$4)+1),COUNTIF($Q$4:$Q18,$Q18)),COLUMNS($B$8:C22)))","v":""},{"$f":"IF($Q18=\"\",\"\",INDEX(zawodniki,SMALL(IF(numerki=$Q18,ROW(numerki)-ROW(J$4)+1),COUNTIF($Q$4:$Q18,$Q18)),COLUMNS($B$8:D22)))","v":""},{"$f":"IF($Q18=\"\",\"\",INDEX(zawodniki,SMALL(IF(numerki=$Q18,ROW(numerki)-ROW(K$4)+1),COUNTIF($Q$4:$Q18,$Q18)),COLUMNS($B$8:E22)))","v":""},{"$f":"IF(ROWS($L$144:L158)>COUNT(numerki),\"\",SMALL(numerki,ROWS($L$144:L158)))","v":""}]
[77,1,"OSIADACZ Brian ",2004,"UKN LAWORTA Ustrzyki Dolne","Gr. 12",null,{"$f":"IF(G19=\"\",\"\",COUNTIF(G$4:G19,G19))","v":""},null,null,null,{"$f":"IF(Q19=\"\",\"\",SUBTOTAL(103,Q$4:Q19))","v":""},{"$f":"IF($Q19=\"\",\"\",INDEX(zawodniki,SMALL(IF(numerki=$Q19,ROW(numerki)-ROW(H$4)+1),COUNTIF($Q$4:$Q19,$Q19)),COLUMNS($B$8:B23)))","v":""},{"$f":"IF($Q19=\"\",\"\",INDEX(zawodniki,SMALL(IF(numerki=$Q19,ROW(numerki)-ROW(I$4)+1),COUNTIF($Q$4:$Q19,$Q19)),COLUMNS($B$8:C23)))","v":""},{"$f":"IF($Q19=\"\",\"\",INDEX(zawodniki,SMALL(IF(numerki=$Q19,ROW(numerki)-ROW(J$4)+1),COUNTIF($Q$4:$Q19,$Q19)),COLUMNS($B$8:D23)))","v":""},{"$f":"IF($Q19=\"\",\"\",INDEX(zawodniki,SMALL(IF(numerki=$Q19,ROW(numerki)-ROW(K$4)+1),COUNTIF($Q$4:$Q19,$Q19)),COLUMNS($B$8:E23)))","v":""},{"$f":"IF(ROWS($L$144:L159)>COUNT(numerki),\"\",SMALL(numerki,ROWS($L$144:L159)))","v":""}]
[78,2,"BABIARZ Dawid ",2002,"UKN LAWORTA Ustrzyki Dolne","Gr. 12",null,{"$f":"IF(G20=\"\",\"\",COUNTIF(G$4:G20,G20))","v":""},null,null,null,{"$f":"IF(Q20=\"\",\"\",SUBTOTAL(103,Q$4:Q20))","v":""},{"$f":"IF($Q20=\"\",\"\",INDEX(zawodniki,SMALL(IF(numerki=$Q20,ROW(numerki)-ROW(H$4)+1),COUNTIF($Q$4:$Q20,$Q20)),COLUMNS($B$8:B24)))","v":""},{"$f":"IF($Q20=\"\",\"\",INDEX(zawodniki,SMALL(IF(numerki=$Q20,ROW(numerki)-ROW(I$4)+1),COUNTIF($Q$4:$Q20,$Q20)),COLUMNS($B$8:C24)))","v":""},{"$f":"IF($Q20=\"\",\"\",INDEX(zawodniki,SMALL(IF(numerki=$Q20,ROW(numerki)-ROW(J$4)+1),COUNTIF($Q$4:$Q20,$Q20)),COLUMNS($B$8:D24)))","v":""},{"$f":"IF($Q20=\"\",\"\",INDEX(zawodniki,SMALL(IF(numerki=$Q20,ROW(numerki)-ROW(K$4)+1),COUNTIF($Q$4:$Q20,$Q20)),COLUMNS($B$8:E24)))","v":""},{"$f":"IF(ROWS($L$144:L160)>COUNT(numerki),\"\",SMALL(numerki,ROWS($L$144:L160)))","v":""}]
[83,3,"PIĘCIAK Konrad",1988,"UKS Gwożdzik Gwoźnica D.","Gr. 12",null,{"$f":"IF(G21=\"\",\"\",COUNTIF(G$4:G21,G21))","v":""},null,null,null,{"$f":"IF(Q21=\"\",\"\",SUBTOTAL(103,Q$4:Q21))","v":""},{"$f":"IF($Q21=\"\",\"\",INDEX(zawodniki,SMALL(IF(numerki=$Q21,ROW(numerki)-ROW(H$4)+1),COUNTIF($Q$4:$Q21,$Q21)),COLUMNS($B$8:B25)))","v":""},{"$f":"IF($Q21=\"\",\"\",INDEX(zawodniki,SMALL(IF(numerki=$Q21,ROW(numerki)-ROW(I$4)+1),COUNTIF($Q$4:$Q21,$Q21)),COLUMNS($B$8:C25)))","v":""},{"$f":"IF($Q21=\"\",\"\",INDEX(zawodniki,SMALL(IF(numerki=$Q21,ROW(numerki)-ROW(J$4)+1),COUNTIF($Q$4:$Q21,$Q21)),COLUMNS($B$8:D25)))","v":""},{"$f":"IF($Q21=\"\",\"\",INDEX(zawodniki,SMALL(IF(numerki=$Q21,ROW(numerki)-ROW(K$4)+1),COUNTIF($Q$4:$Q21,$Q21)),COLUMNS($B$8:E25)))","v":""},{"$f":"IF(ROWS($L$144:L161)>COUNT(numerki),\"\",SMALL(numerki,ROWS($L$144:L161)))","v":""}]
[84,4,"ELMERYCH Paweł ",1975,"UKN LAWORTA Ustrzyki Dolne","Gr. 12",null,{"$f":"IF(G22=\"\",\"\",COUNTIF(G$4:G22,G22))","v":""},null,null,null,{"$f":"IF(Q22=\"\",\"\",SUBTOTAL(103,Q$4:Q22))","v":""},{"$f":"IF($Q22=\"\",\"\",INDEX(zawodniki,SMALL(IF(numerki=$Q22,ROW(numerki)-ROW(H$4)+1),COUNTIF($Q$4:$Q22,$Q22)),COLUMNS($B$8:B26)))","v":""},{"$f":"IF($Q22=\"\",\"\",INDEX(zawodniki,SMALL(IF(numerki=$Q22,ROW(numerki)-ROW(I$4)+1),COUNTIF($Q$4:$Q22,$Q22)),COLUMNS($B$8:C26)))","v":""},{"$f":"IF($Q22=\"\",\"\",INDEX(zawodniki,SMALL(IF(numerki=$Q22,ROW(numerki)-ROW(J$4)+1),COUNTIF($Q$4:$Q22,$Q22)),COLUMNS($B$8:D26)))","v":""},{"$f":"IF($Q22=\"\",\"\",INDEX(zawodniki,SMALL(IF(numerki=$Q22,ROW(numerki)-ROW(K$4)+1),COUNTIF($Q$4:$Q22,$Q22)),COLUMNS($B$8:E26)))","v":""},{"$f":"IF(ROWS($L$144:L162)>COUNT(numerki),\"\",SMALL(numerki,ROWS($L$144:L162)))","v":""}]
[85,5,"BABIARZ Wacław ",1969,"UKN LAWORTA Ustrzyki Dolne","Gr. 12",null,{"$f":"IF(G23=\"\",\"\",COUNTIF(G$4:G23,G23))","v":""},null,null,null,{"$f":"IF(Q23=\"\",\"\",SUBTOTAL(103,Q$4:Q23))","v":""},{"$f":"IF($Q23=\"\",\"\",INDEX(zawodniki,SMALL(IF(numerki=$Q23,ROW(numerki)-ROW(H$4)+1),COUNTIF($Q$4:$Q23,$Q23)),COLUMNS($B$8:B27)))","v":""},{"$f":"IF($Q23=\"\",\"\",INDEX(zawodniki,SMALL(IF(numerki=$Q23,ROW(numerki)-ROW(I$4)+1),COUNTIF($Q$4:$Q23,$Q23)),COLUMNS($B$8:C27)))","v":""},{"$f":"IF($Q23=\"\",\"\",INDEX(zawodniki,SMALL(IF(numerki=$Q23,ROW(numerki)-ROW(J$4)+1),COUNTIF($Q$4:$Q23,$Q23)),COLUMNS($B$8:D27)))","v":""},{"$f":"IF($Q23=\"\",\"\",INDEX(zawodniki,SMALL(IF(numerki=$Q23,ROW(numerki)-ROW(K$4)+1),COUNTIF($Q$4:$Q23,$Q23)),COLUMNS($B$8:E27)))","v":""},{"$f":"IF(ROWS($L$144:L163)>COUNT(numerki),\"\",SMALL(numerki,ROWS($L$144:L163)))","v":""}]
[20,1,"SMOTRYCKA Zuzanna ",2011,"UKS Śródmieście Przemyśl","Gr. 13",null,{"$f":"IF(G24=\"\",\"\",COUNTIF(G$4:G24,G24))","v":""},null,null,null,{"$f":"IF(Q24=\"\",\"\",SUBTOTAL(103,Q$4:Q24))","v":""},{"$f":"IF($Q24=\"\",\"\",INDEX(zawodniki,SMALL(IF(numerki=$Q24,ROW(numerki)-ROW(H$4)+1),COUNTIF($Q$4:$Q24,$Q24)),COLUMNS($B$8:B28)))","v":""},{"$f":"IF($Q24=\"\",\"\",INDEX(zawodniki,SMALL(IF(numerki=$Q24,ROW(numerki)-ROW(I$4)+1),COUNTIF($Q$4:$Q24,$Q24)),COLUMNS($B$8:C28)))","v":""},{"$f":"IF($Q24=\"\",\"\",INDEX(zawodniki,SMALL(IF(numerki=$Q24,ROW(numerki)-ROW(J$4)+1),COUNTIF($Q$4:$Q24,$Q24)),COLUMNS($B$8:D28)))","v":""},{"$f":"IF($Q24=\"\",\"\",INDEX(zawodniki,SMALL(IF(numerki=$Q24,ROW(numerki)-ROW(K$4)+1),COUNTIF($Q$4:$Q24,$Q24)),COLUMNS($B$8:E28)))","v":""},{"$f":"IF(ROWS($L$144:L164)>COUNT(numerki),\"\",SMALL(numerki,ROWS($L$144:L164)))","v":""}]
[86,1,"WÓJCIK Tadeusz ",1950,"SKN Jasło przy ZSM Nr 1","Gr. 14",null,{"$f":"IF(G25=\"\",\"\",COUNTIF(G$4:G25,G25))","v":""},null,null,null,{"$f":"IF(Q25=\"\",\"\",SUBTOTAL(103,Q$4:Q25))","v":""},{"$f":"IF($Q25=\"\",\"\",INDEX(zawodniki,SMALL(IF(numerki=$Q25,ROW(numerki)-ROW(H$4)+1),COUNTIF($Q$4:$Q25,$Q25)),COLUMNS($B$8:B29)))","v":""},{"$f":"IF($Q25=\"\",\"\",INDEX(zawodniki,SMALL(IF(numerki=$Q25,ROW(numerki)-ROW(I$4)+1),COUNTIF($Q$4:$Q25,$Q25)),COLUMNS($B$8:C29)))","v":""},{"$f":"IF($Q25=\"\",\"\",INDEX(zawodniki,SMALL(IF(numerki=$Q25,ROW(numerki)-ROW(J$4)+1),COUNTIF($Q$4:$Q25,$Q25)),COLUMNS($B$8:D29)))","v":""},{"$f":"IF($Q25=\"\",\"\",INDEX(zawodniki,SMALL(IF(numerki=$Q25,ROW(numerki)-ROW(K$4)+1),COUNTIF($Q$4:$Q25,$Q25)),COLUMNS($B$8:E29)))","v":""},{"$f":"IF(ROWS($L$144:L165)>COUNT(numerki),\"\",SMALL(numerki,ROWS($L$144:L165)))","v":""}]
[21,5,"PORĘBA Małgorzta ",2012,"UKS Gwożdzik Gwoźnica D.","Gr. 16",null,{"$f":"IF(G26=\"\",\"\",COUNTIF(G$4:G26,G26))","v":""},null,null,null,{"$f":"IF(Q26=\"\",\"\",SUBTOTAL(103,Q$4:Q26))","v":""},{"$f":"IF($Q26=\"\",\"\",INDEX(zawodniki,SMALL(IF(numerki=$Q26,ROW(numerki)-ROW(H$4)+1),COUNTIF($Q$4:$Q26,$Q26)),COLUMNS($B$8:B30)))","v":""},{"$f":"IF($Q26=\"\",\"\",INDEX(zawodniki,SMALL(IF(numerki=$Q26,ROW(numerki)-ROW(I$4)+1),COUNTIF($Q$4:$Q26,$Q26)),COLUMNS($B$8:C30)))","v":""},{"$f":"IF($Q26=\"\",\"\",INDEX(zawodniki,SMALL(IF(numerki=$Q26,ROW(numerki)-ROW(J$4)+1),COUNTIF($Q$4:$Q26,$Q26)),COLUMNS($B$8:D30)))","v":""},{"$f":"IF($Q26=\"\",\"\",INDEX(zawodniki,SMALL(IF(numerki=$Q26,ROW(numerki)-ROW(K$4)+1),COUNTIF($Q$4:$Q26,$Q26)),COLUMNS($B$8:E30)))","v":""},{"$f":"IF(ROWS($L$144:L166)>COUNT(numerki),\"\",SMALL(numerki,ROWS($L$144:L166)))","v":""}]
[22,4,"GAJDEK Tymoteusz ",2012,"UKN LAWORTA Ustrzyki Dolne","Gr. 16","x",{"$f":"IF(G27=\"\",\"\",COUNTIF(G$4:G27,G27))","v":1},null,null,null,{"$f":"IF(Q27=\"\",\"\",SUBTOTAL(103,Q$4:Q27))","v":""},{"$f":"IF($Q27=\"\",\"\",INDEX(zawodniki,SMALL(IF(numerki=$Q27,ROW(numerki)-ROW(H$4)+1),COUNTIF($Q$4:$Q27,$Q27)),COLUMNS($B$8:B31)))","v":""},{"$f":"IF($Q27=\"\",\"\",INDEX(zawodniki,SMALL(IF(numerki=$Q27,ROW(numerki)-ROW(I$4)+1),COUNTIF($Q$4:$Q27,$Q27)),COLUMNS($B$8:C31)))","v":""},{"$f":"IF($Q27=\"\",\"\",INDEX(zawodniki,SMALL(IF(numerki=$Q27,ROW(numerki)-ROW(J$4)+1),COUNTIF($Q$4:$Q27,$Q27)),COLUMNS($B$8:D31)))","v":""},{"$f":"IF($Q27=\"\",\"\",INDEX(zawodniki,SMALL(IF(numerki=$Q27,ROW(numerki)-ROW(K$4)+1),COUNTIF($Q$4:$Q27,$Q27)),COLUMNS($B$8:E31)))","v":""},{"$f":"IF(ROWS($L$144:L167)>COUNT(numerki),\"\",SMALL(numerki,ROWS($L$144:L167)))","v":""}]
[31,3,"GRĘDA Zuzanna ",2009,"KN Przemyśl SKI","Gr. 16",null,{"$f":"IF(G28=\"\",\"\",COUNTIF(G$4:G28,G28))","v":""},null,null,null,{"$f":"IF(Q28=\"\",\"\",SUBTOTAL(103,Q$4:Q28))","v":""},{"$f":"IF($Q28=\"\",\"\",INDEX(zawodniki,SMALL(IF(numerki=$Q28,ROW(numerki)-ROW(H$4)+1),COUNTIF($Q$4:$Q28,$Q28)),COLUMNS($B$8:B32)))","v":""},{"$f":"IF($Q28=\"\",\"\",INDEX(zawodniki,SMALL(IF(numerki=$Q28,ROW(numerki)-ROW(I$4)+1),COUNTIF($Q$4:$Q28,$Q28)),COLUMNS($B$8:C32)))","v":""},{"$f":"IF($Q28=\"\",\"\",INDEX(zawodniki,SMALL(IF(numerki=$Q28,ROW(numerki)-ROW(J$4)+1),COUNTIF($Q$4:$Q28,$Q28)),COLUMNS($B$8:D32)))","v":""},{"$f":"IF($Q28=\"\",\"\",INDEX(zawodniki,SMALL(IF(numerki=$Q28,ROW(numerki)-ROW(K$4)+1),COUNTIF($Q$4:$Q28,$Q28)),COLUMNS($B$8:E32)))","v":""},{"$f":"IF(ROWS($L$144:L168)>COUNT(numerki),\"\",SMALL(numerki,ROWS($L$144:L168)))","v":""}]
[79,1,"DROZD Krystian ",2003,"UKS Gwożdzik Gwoźnica D.","Gr. 16",null,{"$f":"IF(G29=\"\",\"\",COUNTIF(G$4:G29,G29))","v":""},null,null,null,{"$f":"IF(Q29=\"\",\"\",SUBTOTAL(103,Q$4:Q29))","v":""},{"$f":"IF($Q29=\"\",\"\",INDEX(zawodniki,SMALL(IF(numerki=$Q29,ROW(numerki)-ROW(H$4)+1),COUNTIF($Q$4:$Q29,$Q29)),COLUMNS($B$8:B33)))","v":""},{"$f":"IF($Q29=\"\",\"\",INDEX(zawodniki,SMALL(IF(numerki=$Q29,ROW(numerki)-ROW(I$4)+1),COUNTIF($Q$4:$Q29,$Q29)),COLUMNS($B$8:C33)))","v":""},{"$f":"IF($Q29=\"\",\"\",INDEX(zawodniki,SMALL(IF(numerki=$Q29,ROW(numerki)-ROW(J$4)+1),COUNTIF($Q$4:$Q29,$Q29)),COLUMNS($B$8:D33)))","v":""},{"$f":"IF($Q29=\"\",\"\",INDEX(zawodniki,SMALL(IF(numerki=$Q29,ROW(numerki)-ROW(K$4)+1),COUNTIF($Q$4:$Q29,$Q29)),COLUMNS($B$8:E33)))","v":""},{"$f":"IF(ROWS($L$144:L169)>COUNT(numerki),\"\",SMALL(numerki,ROWS($L$144:L169)))","v":""}]
[80,2,"WOLAN Mateusz ",2003,"UKS Gwożdzik Gwoźnica D.","Gr. 16",null,{"$f":"IF(G30=\"\",\"\",COUNTIF(G$4:G30,G30))","v":""},null,null,null,{"$f":"IF(Q30=\"\",\"\",SUBTOTAL(103,Q$4:Q30))","v":""},{"$f":"IF($Q30=\"\",\"\",INDEX(zawodniki,SMALL(IF(numerki=$Q30,ROW(numerki)-ROW(H$4)+1),COUNTIF($Q$4:$Q30,$Q30)),COLUMNS($B$8:B34)))","v":""},{"$f":"IF($Q30=\"\",\"\",INDEX(zawodniki,SMALL(IF(numerki=$Q30,ROW(numerki)-ROW(I$4)+1),COUNTIF($Q$4:$Q30,$Q30)),COLUMNS($B$8:C34)))","v":""},{"$f":"IF($Q30=\"\",\"\",INDEX(zawodniki,SMALL(IF(numerki=$Q30,ROW(numerki)-ROW(J$4)+1),COUNTIF($Q$4:$Q30,$Q30)),COLUMNS($B$8:D34)))","v":""},{"$f":"IF($Q30=\"\",\"\",INDEX(zawodniki,SMALL(IF(numerki=$Q30,ROW(numerki)-ROW(K$4)+1),COUNTIF($Q$4:$Q30,$Q30)),COLUMNS($B$8:E34)))","v":""},{"$f":"IF(ROWS($L$144:L170)>COUNT(numerki),\"\",SMALL(numerki,ROWS($L$144:L170)))","v":""}]
[87,7,"PROBULSKI Zbigniew ",1953,"Magura Gorlice","Gr. 16",null,{"$f":"IF(G31=\"\",\"\",COUNTIF(G$4:G31,G31))","v":""},null,null,null,{"$f":"IF(Q31=\"\",\"\",SUBTOTAL(103,Q$4:Q31))","v":""},{"$f":"IF($Q31=\"\",\"\",INDEX(zawodniki,SMALL(IF(numerki=$Q31,ROW(numerki)-ROW(H$4)+1),COUNTIF($Q$4:$Q31,$Q31)),COLUMNS($B$8:B35)))","v":""},{"$f":"IF($Q31=\"\",\"\",INDEX(zawodniki,SMALL(IF(numerki=$Q31,ROW(numerki)-ROW(I$4)+1),COUNTIF($Q$4:$Q31,$Q31)),COLUMNS($B$8:C35)))","v":""},{"$f":"IF($Q31=\"\",\"\",INDEX(zawodniki,SMALL(IF(numerki=$Q31,ROW(numerki)-ROW(J$4)+1),COUNTIF($Q$4:$Q31,$Q31)),COLUMNS($B$8:D35)))","v":""},{"$f":"IF($Q31=\"\",\"\",INDEX(zawodniki,SMALL(IF(numerki=$Q31,ROW(numerki)-ROW(K$4)+1),COUNTIF($Q$4:$Q31,$Q31)),COLUMNS($B$8:E35)))","v":""},{"$f":"IF(ROWS($L$144:L171)>COUNT(numerki),\"\",SMALL(numerki,ROWS($L$144:L171)))","v":""}]
[8,6,"GAJDEK Maksymilian ",2014,"UKN LAWORTA Ustrzyki Dolne","Gr. 2","x",{"$f":"IF(G32=\"\",\"\",COUNTIF(G$4:G32,G32))","v":2},null,null,null,{"$f":"IF(Q32=\"\",\"\",SUBTOTAL(103,Q$4:Q32))","v":""},{"$f":"IF($Q32=\"\",\"\",INDEX(zawodniki,SMALL(IF(numerki=$Q32,ROW(numerki)-ROW(H$4)+1),COUNTIF($Q$4:$Q32,$Q32)),COLUMNS($B$8:B36)))","v":""},{"$f":"IF($Q32=\"\",\"\",INDEX(zawodniki,SMALL(IF(numerki=$Q32,ROW(numerki)-ROW(I$4)+1),COUNTIF($Q$4:$Q32,$Q32)),COLUMNS($B$8:C36)))","v":""},{"$f":"IF($Q32=\"\",\"\",INDEX(zawodniki,SMALL(IF(numerki=$Q32,ROW(numerki)-ROW(J$4)+1),COUNTIF($Q$4:$Q32,$Q32)),COLUMNS($B$8:D36)))","v":""},{"$f":"IF($Q32=\"\",\"\",INDEX(zawodniki,SMALL(IF(numerki=$Q32,ROW(numerki)-ROW(K$4)+1),COUNTIF($Q$4:$Q32,$Q32)),COLUMNS($B$8:E36)))","v":""},{"$f":"IF(ROWS($L$144:L172)>COUNT(numerki),\"\",SMALL(numerki,ROWS($L$144:L172)))","v":""}]
[25,4,"SARNICKI Antoni ",2012,"KN Przemyśl SKI","Gr. 2",null,{"$f":"IF(G33=\"\",\"\",COUNTIF(G$4:G33,G33))","v":""},null,null,null,{"$f":"IF(Q33=\"\",\"\",SUBTOTAL(103,Q$4:Q33))","v":""},{"$f":"IF($Q33=\"\",\"\",INDEX(zawodniki,SMALL(IF(numerki=$Q33,ROW(numerki)-ROW(H$4)+1),COUNTIF($Q$4:$Q33,$Q33)),COLUMNS($B$8:B37)))","v":""},{"$f":"IF($Q33=\"\",\"\",INDEX(zawodniki,SMALL(IF(numerki=$Q33,ROW(numerki)-ROW(I$4)+1),COUNTIF($Q$4:$Q33,$Q33)),COLUMNS($B$8:C37)))","v":""},{"$f":"IF($Q33=\"\",\"\",INDEX(zawodniki,SMALL(IF(numerki=$Q33,ROW(numerki)-ROW(J$4)+1),COUNTIF($Q$4:$Q33,$Q33)),COLUMNS($B$8:D37)))","v":""},{"$f":"IF($Q33=\"\",\"\",INDEX(zawodniki,SMALL(IF(numerki=$Q33,ROW(numerki)-ROW(K$4)+1),COUNTIF($Q$4:$Q33,$Q33)),COLUMNS($B$8:E37)))","v":""},{"$f":"IF(ROWS($L$144:L173)>COUNT(numerki),\"\",SMALL(numerki,ROWS($L$144:L173)))","v":""}]
[35,1,"DOŁŻYCKA Lena ",2009,"UKN LAWORTA Ustrzyki Dolne","Gr. 2",null,{"$f":"IF(G34=\"\",\"\",COUNTIF(G$4:G34,G34))","v":""},null,null,null,{"$f":"IF(Q34=\"\",\"\",SUBTOTAL(103,Q$4:Q34))","v":""},{"$f":"IF($Q34=\"\",\"\",INDEX(zawodniki,SMALL(IF(numerki=$Q34,ROW(numerki)-ROW(H$4)+1),COUNTIF($Q$4:$Q34,$Q34)),COLUMNS($B$8:B38)))","v":""},{"$f":"IF($Q34=\"\",\"\",INDEX(zawodniki,SMALL(IF(numerki=$Q34,ROW(numerki)-ROW(I$4)+1),COUNTIF($Q$4:$Q34,$Q34)),COLUMNS($B$8:C38)))","v":""},{"$f":"IF($Q34=\"\",\"\",INDEX(zawodniki,SMALL(IF(numerki=$Q34,ROW(numerki)-ROW(J$4)+1),COUNTIF($Q$4:$Q34,$Q34)),COLUMNS($B$8:D38)))","v":""},{"$f":"IF($Q34=\"\",\"\",INDEX(zawodniki,SMALL(IF(numerki=$Q34,ROW(numerki)-ROW(K$4)+1),COUNTIF($Q$4:$Q34,$Q34)),COLUMNS($B$8:E38)))","v":""},{"$f":"IF(ROWS($L$144:L174)>COUNT(numerki),\"\",SMALL(numerki,ROWS($L$144:L174)))","v":""}]
[36,3,"KULIGOWSKA Zofia ",2010,"UKS Śródmieście Przemyśl","Gr. 2",null,{"$f":"IF(G35=\"\",\"\",COUNTIF(G$4:G35,G35))","v":""},null,null,null,{"$f":"IF(Q35=\"\",\"\",SUBTOTAL(103,Q$4:Q35))","v":""},{"$f":"IF($Q35=\"\",\"\",INDEX(zawodniki,SMALL(IF(numerki=$Q35,ROW(numerki)-ROW(H$4)+1),COUNTIF($Q$4:$Q35,$Q35)),COLUMNS($B$8:B39)))","v":""},{"$f":"IF($Q35=\"\",\"\",INDEX(zawodniki,SMALL(IF(numerki=$Q35,ROW(numerki)-ROW(I$4)+1),COUNTIF($Q$4:$Q35,$Q35)),COLUMNS($B$8:C39)))","v":""},{"$f":"IF($Q35=\"\",\"\",INDEX(zawodniki,SMALL(IF(numerki=$Q35,ROW(numerki)-ROW(J$4)+1),COUNTIF($Q$4:$Q35,$Q35)),COLUMNS($B$8:D39)))","v":""},{"$f":"IF($Q35=\"\",\"\",INDEX(zawodniki,SMALL(IF(numerki=$Q35,ROW(numerki)-ROW(K$4)+1),COUNTIF($Q$4:$Q35,$Q35)),COLUMNS($B$8:E39)))","v":""},{"$f":"IF(ROWS($L$144:L175)>COUNT(numerki),\"\",SMALL(numerki,ROWS($L$144:L175)))","v":""}]
[37,5,"FUTYMA Wiktoria ",2009,"UKN LAWORTA Ustrzyki Dolne","Gr. 2",null,{"$f":"IF(G36=\"\",\"\",COUNTIF(G$4:G36,G36))","v":""},null,null,null,{"$f":"IF(Q36=\"\",\"\",SUBTOTAL(103,Q$4:Q36))","v":""},{"$f":"IF($Q36=\"\",\"\",INDEX(zawodniki,SMALL(IF(numerki=$Q36,ROW(numerki)-ROW(H$4)+1),COUNTIF($Q$4:$Q36,$Q36)),COLUMNS($B$8:B40)))","v":""},{"$f":"IF($Q36=\"\",\"\",INDEX(zawodniki,SMALL(IF(numerki=$Q36,ROW(numerki)-ROW(I$4)+1),COUNTIF($Q$4:$Q36,$Q36)),COLUMNS($B$8:C40)))","v":""},{"$f":"IF($Q36=\"\",\"\",INDEX(zawodniki,SMALL(IF(numerki=$Q36,ROW(numerki)-ROW(J$4)+1),COUNTIF($Q$4:$Q36,$Q36)),COLUMNS($B$8:D40)))","v":""},{"$f":"IF($Q36=\"\",\"\",INDEX(zawodniki,SMALL(IF(numerki=$Q36,ROW(numerki)-ROW(K$4)+1),COUNTIF($Q$4:$Q36,$Q36)),COLUMNS($B$8:E40)))","v":""},{"$f":"IF(ROWS($L$144:L176)>COUNT(numerki),\"\",SMALL(numerki,ROWS($L$144:L176)))","v":""}]
[38,7,"NIKODY Aleksandra ",2009,"SKN Jasło przy ZSM Nr 1","Gr. 2",null,{"$f":"IF(G37=\"\",\"\",COUNTIF(G$4:G37,G37))","v":""},null,null,null,{"$f":"IF(Q37=\"\",\"\",SUBTOTAL(103,Q$4:Q37))","v":""},{"$f":"IF($Q37=\"\",\"\",INDEX(zawodniki,SMALL(IF(numerki=$Q37,ROW(numerki)-ROW(H$4)+1),COUNTIF($Q$4:$Q37,$Q37)),COLUMNS($B$8:B41)))","v":""},{"$f":"IF($Q37=\"\",\"\",INDEX(zawodniki,SMALL(IF(numerki=$Q37,ROW(numerki)-ROW(I$4)+1),COUNTIF($Q$4:$Q37,$Q37)),COLUMNS($B$8:C41)))","v":""},{"$f":"IF($Q37=\"\",\"\",INDEX(zawodniki,SMALL(IF(numerki=$Q37,ROW(numerki)-ROW(J$4)+1),COUNTIF($Q$4:$Q37,$Q37)),COLUMNS($B$8:D41)))","v":""},{"$f":"IF($Q37=\"\",\"\",INDEX(zawodniki,SMALL(IF(numerki=$Q37,ROW(numerki)-ROW(K$4)+1),COUNTIF($Q$4:$Q37,$Q37)),COLUMNS($B$8:E41)))","v":""},{"$f":"IF(ROWS($L$144:L177)>COUNT(numerki),\"\",SMALL(numerki,ROWS($L$144:L177)))","v":""}]
[39,8,"SEMP Damian ",2009,"KN Przemyśl SKI","Gr. 2",null,{"$f":"IF(G38=\"\",\"\",COUNTIF(G$4:G38,G38))","v":""},null,null,null,{"$f":"IF(Q38=\"\",\"\",SUBTOTAL(103,Q$4:Q38))","v":""},{"$f":"IF($Q38=\"\",\"\",INDEX(zawodniki,SMALL(IF(numerki=$Q38,ROW(numerki)-ROW(H$4)+1),COUNTIF($Q$4:$Q38,$Q38)),COLUMNS($B$8:B42)))","v":""},{"$f":"IF($Q38=\"\",\"\",INDEX(zawodniki,SMALL(IF(numerki=$Q38,ROW(numerki)-ROW(I$4)+1),COUNTIF($Q$4:$Q38,$Q38)),COLUMNS($B$8:C42)))","v":""},{"$f":"IF($Q38=\"\",\"\",INDEX(zawodniki,SMALL(IF(numerki=$Q38,ROW(numerki)-ROW(J$4)+1),COUNTIF($Q$4:$Q38,$Q38)),COLUMNS($B$8:D42)))","v":""},{"$f":"IF($Q38=\"\",\"\",INDEX(zawodniki,SMALL(IF(numerki=$Q38,ROW(numerki)-ROW(K$4)+1),COUNTIF($Q$4:$Q38,$Q38)),COLUMNS($B$8:E42)))","v":""},{"$f":"IF(ROWS($L$144:L178)>COUNT(numerki),\"\",SMALL(numerki,ROWS($L$144:L178)))","v":""}]
[88,2,"GUDZELAK Józef ",1948,"KN Przemyśl SKI","Gr. 2",null,{"$f":"IF(G39=\"\",\"\",COUNTIF(G$4:G39,G39))","v":""},null,null,null,{"$f":"IF(Q39=\"\",\"\",SUBTOTAL(103,Q$4:Q39))","v":""},{"$f":"IF($Q39=\"\",\"\",INDEX(zawodniki,SMALL(IF(numerki=$Q39,ROW(numerki)-ROW(H$4)+1),COUNTIF($Q$4:$Q39,$Q39)),COLUMNS($B$8:B43)))","v":""},{"$f":"IF($Q39=\"\",\"\",INDEX(zawodniki,SMALL(IF(numerki=$Q39,ROW(numerki)-ROW(I$4)+1),COUNTIF($Q$4:$Q39,$Q39)),COLUMNS($B$8:C43)))","v":""},{"$f":"IF($Q39=\"\",\"\",INDEX(zawodniki,SMALL(IF(numerki=$Q39,ROW(numerki)-ROW(J$4)+1),COUNTIF($Q$4:$Q39,$Q39)),COLUMNS($B$8:D43)))","v":""},{"$f":"IF($Q39=\"\",\"\",INDEX(zawodniki,SMALL(IF(numerki=$Q39,ROW(numerki)-ROW(K$4)+1),COUNTIF($Q$4:$Q39,$Q39)),COLUMNS($B$8:E43)))","v":""},{"$f":"IF(ROWS($L$144:L179)>COUNT(numerki),\"\",SMALL(numerki,ROWS($L$144:L179)))","v":""}]
[2,1,"MACH Milena ",2013,"KN Przemyśl SKI","Gr. 3",null,{"$f":"IF(G40=\"\",\"\",COUNTIF(G$4:G40,G40))","v":""},null,null,null,{"$f":"IF(Q40=\"\",\"\",SUBTOTAL(103,Q$4:Q40))","v":""},{"$f":"IF($Q40=\"\",\"\",INDEX(zawodniki,SMALL(IF(numerki=$Q40,ROW(numerki)-ROW(H$4)+1),COUNTIF($Q$4:$Q40,$Q40)),COLUMNS($B$8:B44)))","v":""},{"$f":"IF($Q40=\"\",\"\",INDEX(zawodniki,SMALL(IF(numerki=$Q40,ROW(numerki)-ROW(I$4)+1),COUNTIF($Q$4:$Q40,$Q40)),COLUMNS($B$8:C44)))","v":""},{"$f":"IF($Q40=\"\",\"\",INDEX(zawodniki,SMALL(IF(numerki=$Q40,ROW(numerki)-ROW(J$4)+1),COUNTIF($Q$4:$Q40,$Q40)),COLUMNS($B$8:D44)))","v":""},{"$f":"IF($Q40=\"\",\"\",INDEX(zawodniki,SMALL(IF(numerki=$Q40,ROW(numerki)-ROW(K$4)+1),COUNTIF($Q$4:$Q40,$Q40)),COLUMNS($B$8:E44)))","v":""},{"$f":"IF(ROWS($L$144:L180)>COUNT(numerki),\"\",SMALL(numerki,ROWS($L$144:L180)))","v":""}]
[9,2,"SZOPNIEWSKI Michał ",2013,"SKN Jasło przy ZSM Nr 1","Gr. 3",null,{"$f":"IF(G41=\"\",\"\",COUNTIF(G$4:G41,G41))","v":""},null,null,null,{"$f":"IF(Q41=\"\",\"\",SUBTOTAL(103,Q$4:Q41))","v":""},{"$f":"IF($Q41=\"\",\"\",INDEX(zawodniki,SMALL(IF(numerki=$Q41,ROW(numerki)-ROW(H$4)+1),COUNTIF($Q$4:$Q41,$Q41)),COLUMNS($B$8:B45)))","v":""},{"$f":"IF($Q41=\"\",\"\",INDEX(zawodniki,SMALL(IF(numerki=$Q41,ROW(numerki)-ROW(I$4)+1),COUNTIF($Q$4:$Q41,$Q41)),COLUMNS($B$8:C45)))","v":""},{"$f":"IF($Q41=\"\",\"\",INDEX(zawodniki,SMALL(IF(numerki=$Q41,ROW(numerki)-ROW(J$4)+1),COUNTIF($Q$4:$Q41,$Q41)),COLUMNS($B$8:D45)))","v":""},{"$f":"IF($Q41=\"\",\"\",INDEX(zawodniki,SMALL(IF(numerki=$Q41,ROW(numerki)-ROW(K$4)+1),COUNTIF($Q$4:$Q41,$Q41)),COLUMNS($B$8:E45)))","v":""},{"$f":"IF(ROWS($L$144:L181)>COUNT(numerki),\"\",SMALL(numerki,ROWS($L$144:L181)))","v":""}]
[40,3,"ROGALIŃSKI Stefan ",2010,"UKN LAWORTA Ustrzyki Dolne","Gr. 3",null,{"$f":"IF(G42=\"\",\"\",COUNTIF(G$4:G42,G42))","v":""},null,null,null,{"$f":"IF(Q42=\"\",\"\",SUBTOTAL(103,Q$4:Q42))","v":""},{"$f":"IF($Q42=\"\",\"\",INDEX(zawodniki,SMALL(IF(numerki=$Q42,ROW(numerki)-ROW(H$4)+1),COUNTIF($Q$4:$Q42,$Q42)),COLUMNS($B$8:B46)))","v":""},{"$f":"IF($Q42=\"\",\"\",INDEX(zawodniki,SMALL(IF(numerki=$Q42,ROW(numerki)-ROW(I$4)+1),COUNTIF($Q$4:$Q42,$Q42)),COLUMNS($B$8:C46)))","v":""},{"$f":"IF($Q42=\"\",\"\",INDEX(zawodniki,SMALL(IF(numerki=$Q42,ROW(numerki)-ROW(J$4)+1),COUNTIF($Q$4:$Q42,$Q42)),COLUMNS($B$8:D46)))","v":""},{"$f":"IF($Q42=\"\",\"\",INDEX(zawodniki,SMALL(IF(numerki=$Q42,ROW(numerki)-ROW(K$4)+1),COUNTIF($Q$4:$Q42,$Q42)),COLUMNS($B$8:E46)))","v":""},{"$f":"IF(ROWS($L$144:L182)>COUNT(numerki),\"\",SMALL(numerki,ROWS($L$144:L182)))","v":""}]
[41,4,"JANDURA Adam ",2009,"SKN Jasło przy ZSM Nr 1","Gr. 3",null,{"$f":"IF(G43=\"\",\"\",COUNTIF(G$4:G43,G43))","v":""},null,null,null,{"$f":"IF(Q43=\"\",\"\",SUBTOTAL(103,Q$4:Q43))","v":""},{"$f":"IF($Q43=\"\",\"\",INDEX(zawodniki,SMALL(IF(numerki=$Q43,ROW(numerki)-ROW(H$4)+1),COUNTIF($Q$4:$Q43,$Q43)),COLUMNS($B$8:B47)))","v":""},{"$f":"IF($Q43=\"\",\"\",INDEX(zawodniki,SMALL(IF(numerki=$Q43,ROW(numerki)-ROW(I$4)+1),COUNTIF($Q$4:$Q43,$Q43)),COLUMNS($B$8:C47)))","v":""},{"$f":"IF($Q43=\"\",\"\",INDEX(zawodniki,SMALL(IF(numerki=$Q43,ROW(numerki)-ROW(J$4)+1),COUNTIF($Q$4:$Q43,$Q43)),COLUMNS($B$8:D47)))","v":""},{"$f":"IF($Q43=\"\",\"\",INDEX(zawodniki,SMALL(IF(numerki=$Q43,ROW(numerki)-ROW(K$4)+1),COUNTIF($Q$4:$Q43,$Q43)),COLUMNS($B$8:E47)))","v":""},{"$f":"IF(ROWS($L$144:L183)>COUNT(numerki),\"\",SMALL(numerki,ROWS($L$144:L183)))","v":""}]
[42,6,"SZOPNIEWSKI Adam ",2009,"SKN Jasło przy ZSM Nr 1","Gr. 3",null,{"$f":"IF(G44=\"\",\"\",COUNTIF(G$4:G44,G44))","v":""},null,null,null,{"$f":"IF(Q44=\"\",\"\",SUBTOTAL(103,Q$4:Q44))","v":""},{"$f":"IF($Q44=\"\",\"\",INDEX(zawodniki,SMALL(IF(numerki=$Q44,ROW(numerki)-ROW(H$4)+1),COUNTIF($Q$4:$Q44,$Q44)),COLUMNS($B$8:B48)))","v":""},{"$f":"IF($Q44=\"\",\"\",INDEX(zawodniki,SMALL(IF(numerki=$Q44,ROW(numerki)-ROW(I$4)+1),COUNTIF($Q$4:$Q44,$Q44)),COLUMNS($B$8:C48)))","v":""},{"$f":"IF($Q44=\"\",\"\",INDEX(zawodniki,SMALL(IF(numerki=$Q44,ROW(numerki)-ROW(J$4)+1),COUNTIF($Q$4:$Q44,$Q44)),COLUMNS($B$8:D48)))","v":""},{"$f":"IF($Q44=\"\",\"\",INDEX(zawodniki,SMALL(IF(numerki=$Q44,ROW(numerki)-ROW(K$4)+1),COUNTIF($Q$4:$Q44,$Q44)),COLUMNS($B$8:E48)))","v":""},{"$f":"IF(ROWS($L$144:L184)>COUNT(numerki),\"\",SMALL(numerki,ROWS($L$144:L184)))","v":""}]
[81,8,"SOŁTYS Mateusz ",2002,"UKS Gwożdzik Gwoźnica D.","Gr. 3",null,{"$f":"IF(G45=\"\",\"\",COUNTIF(G$4:G45,G45))","v":""},null,null,null,{"$f":"IF(Q45=\"\",\"\",SUBTOTAL(103,Q$4:Q45))","v":""},{"$f":"IF($Q45=\"\",\"\",INDEX(zawodniki,SMALL(IF(numerki=$Q45,ROW(numerki)-ROW(H$4)+1),COUNTIF($Q$4:$Q45,$Q45)),COLUMNS($B$8:B49)))","v":""},{"$f":"IF($Q45=\"\",\"\",INDEX(zawodniki,SMALL(IF(numerki=$Q45,ROW(numerki)-ROW(I$4)+1),COUNTIF($Q$4:$Q45,$Q45)),COLUMNS($B$8:C49)))","v":""},{"$f":"IF($Q45=\"\",\"\",INDEX(zawodniki,SMALL(IF(numerki=$Q45,ROW(numerki)-ROW(J$4)+1),COUNTIF($Q$4:$Q45,$Q45)),COLUMNS($B$8:D49)))","v":""},{"$f":"IF($Q45=\"\",\"\",INDEX(zawodniki,SMALL(IF(numerki=$Q45,ROW(numerki)-ROW(K$4)+1),COUNTIF($Q$4:$Q45,$Q45)),COLUMNS($B$8:E49)))","v":""},{"$f":"IF(ROWS($L$144:L185)>COUNT(numerki),\"\",SMALL(numerki,ROWS($L$144:L185)))","v":""}]
[89,5,"SZOPNIEWSKI Daniel ",1977,"SKN Jasło przy ZSM Nr 1","Gr. 3",null,{"$f":"IF(G46=\"\",\"\",COUNTIF(G$4:G46,G46))","v":""},null,null,null,{"$f":"IF(Q46=\"\",\"\",SUBTOTAL(103,Q$4:Q46))","v":""},{"$f":"IF($Q46=\"\",\"\",INDEX(zawodniki,SMALL(IF(numerki=$Q46,ROW(numerki)-ROW(H$4)+1),COUNTIF($Q$4:$Q46,$Q46)),COLUMNS($B$8:B50)))","v":""},{"$f":"IF($Q46=\"\",\"\",INDEX(zawodniki,SMALL(IF(numerki=$Q46,ROW(numerki)-ROW(I$4)+1),COUNTIF($Q$4:$Q46,$Q46)),COLUMNS($B$8:C50)))","v":""},{"$f":"IF($Q46=\"\",\"\",INDEX(zawodniki,SMALL(IF(numerki=$Q46,ROW(numerki)-ROW(J$4)+1),COUNTIF($Q$4:$Q46,$Q46)),COLUMNS($B$8:D50)))","v":""},{"$f":"IF($Q46=\"\",\"\",INDEX(zawodniki,SMALL(IF(numerki=$Q46,ROW(numerki)-ROW(K$4)+1),COUNTIF($Q$4:$Q46,$Q46)),COLUMNS($B$8:E50)))","v":""},{"$f":"IF(ROWS($L$144:L186)>COUNT(numerki),\"\",SMALL(numerki,ROWS($L$144:L186)))","v":""}]
[90,7,"PORĘBA Adam ",1971,"UKS Gwożdzik Gwoźnica D.","Gr. 3",null,{"$f":"IF(G47=\"\",\"\",COUNTIF(G$4:G47,G47))","v":""},null,null,null,{"$f":"IF(Q47=\"\",\"\",SUBTOTAL(103,Q$4:Q47))","v":""},{"$f":"IF($Q47=\"\",\"\",INDEX(zawodniki,SMALL(IF(numerki=$Q47,ROW(numerki)-ROW(H$4)+1),COUNTIF($Q$4:$Q47,$Q47)),COLUMNS($B$8:B51)))","v":""},{"$f":"IF($Q47=\"\",\"\",INDEX(zawodniki,SMALL(IF(numerki=$Q47,ROW(numerki)-ROW(I$4)+1),COUNTIF($Q$4:$Q47,$Q47)),COLUMNS($B$8:C51)))","v":""},{"$f":"IF($Q47=\"\",\"\",INDEX(zawodniki,SMALL(IF(numerki=$Q47,ROW(numerki)-ROW(J$4)+1),COUNTIF($Q$4:$Q47,$Q47)),COLUMNS($B$8:D51)))","v":""},{"$f":"IF($Q47=\"\",\"\",INDEX(zawodniki,SMALL(IF(numerki=$Q47,ROW(numerki)-ROW(K$4)+1),COUNTIF($Q$4:$Q47,$Q47)),COLUMNS($B$8:E51)))","v":""},{"$f":"IF(ROWS($L$144:L187)>COUNT(numerki),\"\",SMALL(numerki,ROWS($L$144:L187)))","v":""}]
[10,2,"PABIS Filip ",2013,"UKN LAWORTA Ustrzyki Dolne","Gr. 4",null,{"$f":"IF(G48=\"\",\"\",COUNTIF(G$4:G48,G48))","v":""},null,null,null,{"$f":"IF(Q48=\"\",\"\",SUBTOTAL(103,Q$4:Q48))","v":""},{"$f":"IF($Q48=\"\",\"\",INDEX(zawodniki,SMALL(IF(numerki=$Q48,ROW(numerki)-ROW(H$4)+1),COUNTIF($Q$4:$Q48,$Q48)),COLUMNS($B$8:B52)))","v":""},{"$f":"IF($Q48=\"\",\"\",INDEX(zawodniki,SMALL(IF(numerki=$Q48,ROW(numerki)-ROW(I$4)+1),COUNTIF($Q$4:$Q48,$Q48)),COLUMNS($B$8:C52)))","v":""},{"$f":"IF($Q48=\"\",\"\",INDEX(zawodniki,SMALL(IF(numerki=$Q48,ROW(numerki)-ROW(J$4)+1),COUNTIF($Q$4:$Q48,$Q48)),COLUMNS($B$8:D52)))","v":""},{"$f":"IF($Q48=\"\",\"\",INDEX(zawodniki,SMALL(IF(numerki=$Q48,ROW(numerki)-ROW(K$4)+1),COUNTIF($Q$4:$Q48,$Q48)),COLUMNS($B$8:E52)))","v":""},{"$f":"IF(ROWS($L$144:L188)>COUNT(numerki),\"\",SMALL(numerki,ROWS($L$144:L188)))","v":""}]
[11,4,"BUGERA Antoni ",2013,"KN Przemyśl SKI","Gr. 4",null,{"$f":"IF(G49=\"\",\"\",COUNTIF(G$4:G49,G49))","v":""},null,null,null,{"$f":"IF(Q49=\"\",\"\",SUBTOTAL(103,Q$4:Q49))","v":""},{"$f":"IF($Q49=\"\",\"\",INDEX(zawodniki,SMALL(IF(numerki=$Q49,ROW(numerki)-ROW(H$4)+1),COUNTIF($Q$4:$Q49,$Q49)),COLUMNS($B$8:B53)))","v":""},{"$f":"IF($Q49=\"\",\"\",INDEX(zawodniki,SMALL(IF(numerki=$Q49,ROW(numerki)-ROW(I$4)+1),COUNTIF($Q$4:$Q49,$Q49)),COLUMNS($B$8:C53)))","v":""},{"$f":"IF($Q49=\"\",\"\",INDEX(zawodniki,SMALL(IF(numerki=$Q49,ROW(numerki)-ROW(J$4)+1),COUNTIF($Q$4:$Q49,$Q49)),COLUMNS($B$8:D53)))","v":""},{"$f":"IF($Q49=\"\",\"\",INDEX(zawodniki,SMALL(IF(numerki=$Q49,ROW(numerki)-ROW(K$4)+1),COUNTIF($Q$4:$Q49,$Q49)),COLUMNS($B$8:E53)))","v":""},{"$f":"IF(ROWS($L$144:L189)>COUNT(numerki),\"\",SMALL(numerki,ROWS($L$144:L189)))","v":""}]
[43,1,"KUŁAK Szymon ",2009,"KN Przemyśl SKI","Gr. 4",null,{"$f":"IF(G50=\"\",\"\",COUNTIF(G$4:G50,G50))","v":""},null,null,null,{"$f":"IF(Q50=\"\",\"\",SUBTOTAL(103,Q$4:Q50))","v":""},{"$f":"IF($Q50=\"\",\"\",INDEX(zawodniki,SMALL(IF(numerki=$Q50,ROW(numerki)-ROW(H$4)+1),COUNTIF($Q$4:$Q50,$Q50)),COLUMNS($B$8:B54)))","v":""},{"$f":"IF($Q50=\"\",\"\",INDEX(zawodniki,SMALL(IF(numerki=$Q50,ROW(numerki)-ROW(I$4)+1),COUNTIF($Q$4:$Q50,$Q50)),COLUMNS($B$8:C54)))","v":""},{"$f":"IF($Q50=\"\",\"\",INDEX(zawodniki,SMALL(IF(numerki=$Q50,ROW(numerki)-ROW(J$4)+1),COUNTIF($Q$4:$Q50,$Q50)),COLUMNS($B$8:D54)))","v":""},{"$f":"IF($Q50=\"\",\"\",INDEX(zawodniki,SMALL(IF(numerki=$Q50,ROW(numerki)-ROW(K$4)+1),COUNTIF($Q$4:$Q50,$Q50)),COLUMNS($B$8:E54)))","v":""},{"$f":"IF(ROWS($L$144:L190)>COUNT(numerki),\"\",SMALL(numerki,ROWS($L$144:L190)))","v":""}]
[44,5,"KUTER Krzysztof ",2009,"UKN LAWORTA Ustrzyki Dolne","Gr. 4",null,{"$f":"IF(G51=\"\",\"\",COUNTIF(G$4:G51,G51))","v":""},null,null,null,{"$f":"IF(Q51=\"\",\"\",SUBTOTAL(103,Q$4:Q51))","v":""},{"$f":"IF($Q51=\"\",\"\",INDEX(zawodniki,SMALL(IF(numerki=$Q51,ROW(numerki)-ROW(H$4)+1),COUNTIF($Q$4:$Q51,$Q51)),COLUMNS($B$8:B55)))","v":""},{"$f":"IF($Q51=\"\",\"\",INDEX(zawodniki,SMALL(IF(numerki=$Q51,ROW(numerki)-ROW(I$4)+1),COUNTIF($Q$4:$Q51,$Q51)),COLUMNS($B$8:C55)))","v":""},{"$f":"IF($Q51=\"\",\"\",INDEX(zawodniki,SMALL(IF(numerki=$Q51,ROW(numerki)-ROW(J$4)+1),COUNTIF($Q$4:$Q51,$Q51)),COLUMNS($B$8:D55)))","v":""},{"$f":"IF($Q51=\"\",\"\",INDEX(zawodniki,SMALL(IF(numerki=$Q51,ROW(numerki)-ROW(K$4)+1),COUNTIF($Q$4:$Q51,$Q51)),COLUMNS($B$8:E55)))","v":""},{"$f":"IF(ROWS($L$144:L191)>COUNT(numerki),\"\",SMALL(numerki,ROWS($L$144:L191)))","v":""}]
[45,6,"ŁUKASIEWICZ Olek ",2009,"PTN Przemyśl","Gr. 4",null,{"$f":"IF(G52=\"\",\"\",COUNTIF(G$4:G52,G52))","v":""},null,null,null,{"$f":"IF(Q52=\"\",\"\",SUBTOTAL(103,Q$4:Q52))","v":""},{"$f":"IF($Q52=\"\",\"\",INDEX(zawodniki,SMALL(IF(numerki=$Q52,ROW(numerki)-ROW(H$4)+1),COUNTIF($Q$4:$Q52,$Q52)),COLUMNS($B$8:B56)))","v":""},{"$f":"IF($Q52=\"\",\"\",INDEX(zawodniki,SMALL(IF(numerki=$Q52,ROW(numerki)-ROW(I$4)+1),COUNTIF($Q$4:$Q52,$Q52)),COLUMNS($B$8:C56)))","v":""},{"$f":"IF($Q52=\"\",\"\",INDEX(zawodniki,SMALL(IF(numerki=$Q52,ROW(numerki)-ROW(J$4)+1),COUNTIF($Q$4:$Q52,$Q52)),COLUMNS($B$8:D56)))","v":""},{"$f":"IF($Q52=\"\",\"\",INDEX(zawodniki,SMALL(IF(numerki=$Q52,ROW(numerki)-ROW(K$4)+1),COUNTIF($Q$4:$Q52,$Q52)),COLUMNS($B$8:E56)))","v":""},{"$f":"IF(ROWS($L$144:L192)>COUNT(numerki),\"\",SMALL(numerki,ROWS($L$144:L192)))","v":""}]
[46,7,"DZIURZYŃSKI Szymon ",2010,"PTN Przemyśl","Gr. 4",null,{"$f":"IF(G53=\"\",\"\",COUNTIF(G$4:G53,G53))","v":""},null,null,null,{"$f":"IF(Q53=\"\",\"\",SUBTOTAL(103,Q$4:Q53))","v":""},{"$f":"IF($Q53=\"\",\"\",INDEX(zawodniki,SMALL(IF(numerki=$Q53,ROW(numerki)-ROW(H$4)+1),COUNTIF($Q$4:$Q53,$Q53)),COLUMNS($B$8:B57)))","v":""},{"$f":"IF($Q53=\"\",\"\",INDEX(zawodniki,SMALL(IF(numerki=$Q53,ROW(numerki)-ROW(I$4)+1),COUNTIF($Q$4:$Q53,$Q53)),COLUMNS($B$8:C57)))","v":""},{"$f":"IF($Q53=\"\",\"\",INDEX(zawodniki,SMALL(IF(numerki=$Q53,ROW(numerki)-ROW(J$4)+1),COUNTIF($Q$4:$Q53,$Q53)),COLUMNS($B$8:D57)))","v":""},{"$f":"IF($Q53=\"\",\"\",INDEX(zawodniki,SMALL(IF(numerki=$Q53,ROW(numerki)-ROW(K$4)+1),COUNTIF($Q$4:$Q53,$Q53)),COLUMNS($B$8:E57)))","v":""},{"$f":"IF(ROWS($L$144:L193)>COUNT(numerki),\"\",SMALL(numerki,ROWS($L$144:L193)))","v":""}]
[91,3,"BOCER Jakub ",2012,"UKS Śródmieście Przemyśl","Gr. 4",null,{"$f":"IF(G54=\"\",\"\",COUNTIF(G$4:G54,G54))","v":""},null,null,null,{"$f":"IF(Q54=\"\",\"\",SUBTOTAL(103,Q$4:Q54))","v":""},{"$f":"IF($Q54=\"\",\"\",INDEX(zawodniki,SMALL(IF(numerki=$Q54,ROW(numerki)-ROW(H$4)+1),COUNTIF($Q$4:$Q54,$Q54)),COLUMNS($B$8:B58)))","v":""},{"$f":"IF($Q54=\"\",\"\",INDEX(zawodniki,SMALL(IF(numerki=$Q54,ROW(numerki)-ROW(I$4)+1),COUNTIF($Q$4:$Q54,$Q54)),COLUMNS($B$8:C58)))","v":""},{"$f":"IF($Q54=\"\",\"\",INDEX(zawodniki,SMALL(IF(numerki=$Q54,ROW(numerki)-ROW(J$4)+1),COUNTIF($Q$4:$Q54,$Q54)),COLUMNS($B$8:D58)))","v":""},{"$f":"IF($Q54=\"\",\"\",INDEX(zawodniki,SMALL(IF(numerki=$Q54,ROW(numerki)-ROW(K$4)+1),COUNTIF($Q$4:$Q54,$Q54)),COLUMNS($B$8:E58)))","v":""},{"$f":"IF(ROWS($L$144:L194)>COUNT(numerki),\"\",SMALL(numerki,ROWS($L$144:L194)))","v":""}]
[3,1,"GRĘDA Agata ",2013,"KN Przemyśl SKI","Gr. 5",null,{"$f":"IF(G55=\"\",\"\",COUNTIF(G$4:G55,G55))","v":""},null,null,null,{"$f":"IF(Q55=\"\",\"\",SUBTOTAL(103,Q$4:Q55))","v":""},{"$f":"IF($Q55=\"\",\"\",INDEX(zawodniki,SMALL(IF(numerki=$Q55,ROW(numerki)-ROW(H$4)+1),COUNTIF($Q$4:$Q55,$Q55)),COLUMNS($B$8:B59)))","v":""},{"$f":"IF($Q55=\"\",\"\",INDEX(zawodniki,SMALL(IF(numerki=$Q55,ROW(numerki)-ROW(I$4)+1),COUNTIF($Q$4:$Q55,$Q55)),COLUMNS($B$8:C59)))","v":""},{"$f":"IF($Q55=\"\",\"\",INDEX(zawodniki,SMALL(IF(numerki=$Q55,ROW(numerki)-ROW(J$4)+1),COUNTIF($Q$4:$Q55,$Q55)),COLUMNS($B$8:D59)))","v":""},{"$f":"IF($Q55=\"\",\"\",INDEX(zawodniki,SMALL(IF(numerki=$Q55,ROW(numerki)-ROW(K$4)+1),COUNTIF($Q$4:$Q55,$Q55)),COLUMNS($B$8:E59)))","v":""},{"$f":"IF(ROWS($L$144:L195)>COUNT(numerki),\"\",SMALL(numerki,ROWS($L$144:L195)))","v":""}]
[12,2,"LEJOWSKI Filip ",2013,"UKN LAWORTA Ustrzyki Dolne","Gr. 5",null,{"$f":"IF(G56=\"\",\"\",COUNTIF(G$4:G56,G56))","v":""},null,null,null,{"$f":"IF(Q56=\"\",\"\",SUBTOTAL(103,Q$4:Q56))","v":""},{"$f":"IF($Q56=\"\",\"\",INDEX(zawodniki,SMALL(IF(numerki=$Q56,ROW(numerki)-ROW(H$4)+1),COUNTIF($Q$4:$Q56,$Q56)),COLUMNS($B$8:B60)))","v":""},{"$f":"IF($Q56=\"\",\"\",INDEX(zawodniki,SMALL(IF(numerki=$Q56,ROW(numerki)-ROW(I$4)+1),COUNTIF($Q$4:$Q56,$Q56)),COLUMNS($B$8:C60)))","v":""},{"$f":"IF($Q56=\"\",\"\",INDEX(zawodniki,SMALL(IF(numerki=$Q56,ROW(numerki)-ROW(J$4)+1),COUNTIF($Q$4:$Q56,$Q56)),COLUMNS($B$8:D60)))","v":""},{"$f":"IF($Q56=\"\",\"\",INDEX(zawodniki,SMALL(IF(numerki=$Q56,ROW(numerki)-ROW(K$4)+1),COUNTIF($Q$4:$Q56,$Q56)),COLUMNS($B$8:E60)))","v":""},{"$f":"IF(ROWS($L$144:L196)>COUNT(numerki),\"\",SMALL(numerki,ROWS($L$144:L196)))","v":""}]
[13,3,"FUTYMA Igor ",2013,"UKN LAWORTA Ustrzyki Dolne","Gr. 5",null,{"$f":"IF(G57=\"\",\"\",COUNTIF(G$4:G57,G57))","v":""},null,null,null,{"$f":"IF(Q57=\"\",\"\",SUBTOTAL(103,Q$4:Q57))","v":""},{"$f":"IF($Q57=\"\",\"\",INDEX(zawodniki,SMALL(IF(numerki=$Q57,ROW(numerki)-ROW(H$4)+1),COUNTIF($Q$4:$Q57,$Q57)),COLUMNS($B$8:B61)))","v":""},{"$f":"IF($Q57=\"\",\"\",INDEX(zawodniki,SMALL(IF(numerki=$Q57,ROW(numerki)-ROW(I$4)+1),COUNTIF($Q$4:$Q57,$Q57)),COLUMNS($B$8:C61)))","v":""},{"$f":"IF($Q57=\"\",\"\",INDEX(zawodniki,SMALL(IF(numerki=$Q57,ROW(numerki)-ROW(J$4)+1),COUNTIF($Q$4:$Q57,$Q57)),COLUMNS($B$8:D61)))","v":""},{"$f":"IF($Q57=\"\",\"\",INDEX(zawodniki,SMALL(IF(numerki=$Q57,ROW(numerki)-ROW(K$4)+1),COUNTIF($Q$4:$Q57,$Q57)),COLUMNS($B$8:E61)))","v":""},{"$f":"IF(ROWS($L$144:L197)>COUNT(numerki),\"\",SMALL(numerki,ROWS($L$144:L197)))","v":""}]
[14,5,"LEŚNIAK Zuzanna-Maria ",2011,"KN Gondola Krynica","Gr. 5",null,{"$f":"IF(G58=\"\",\"\",COUNTIF(G$4:G58,G58))","v":""},null,null,null,{"$f":"IF(Q58=\"\",\"\",SUBTOTAL(103,Q$4:Q58))","v":""},{"$f":"IF($Q58=\"\",\"\",INDEX(zawodniki,SMALL(IF(numerki=$Q58,ROW(numerki)-ROW(H$4)+1),COUNTIF($Q$4:$Q58,$Q58)),COLUMNS($B$8:B62)))","v":""},{"$f":"IF($Q58=\"\",\"\",INDEX(zawodniki,SMALL(IF(numerki=$Q58,ROW(numerki)-ROW(I$4)+1),COUNTIF($Q$4:$Q58,$Q58)),COLUMNS($B$8:C62)))","v":""},{"$f":"IF($Q58=\"\",\"\",INDEX(zawodniki,SMALL(IF(numerki=$Q58,ROW(numerki)-ROW(J$4)+1),COUNTIF($Q$4:$Q58,$Q58)),COLUMNS($B$8:D62)))","v":""},{"$f":"IF($Q58=\"\",\"\",INDEX(zawodniki,SMALL(IF(numerki=$Q58,ROW(numerki)-ROW(K$4)+1),COUNTIF($Q$4:$Q58,$Q58)),COLUMNS($B$8:E62)))","v":""},{"$f":"IF(ROWS($L$144:L198)>COUNT(numerki),\"\",SMALL(numerki,ROWS($L$144:L198)))","v":""}]
[26,10,"KOKOSZYŃSKI Franciszek ",2011,"UKN LAWORTA Ustrzyki Dolne","Gr. 5",null,{"$f":"IF(G59=\"\",\"\",COUNTIF(G$4:G59,G59))","v":""},null,null,null,{"$f":"IF(Q59=\"\",\"\",SUBTOTAL(103,Q$4:Q59))","v":""},{"$f":"IF($Q59=\"\",\"\",INDEX(zawodniki,SMALL(IF(numerki=$Q59,ROW(numerki)-ROW(H$4)+1),COUNTIF($Q$4:$Q59,$Q59)),COLUMNS($B$8:B63)))","v":""},{"$f":"IF($Q59=\"\",\"\",INDEX(zawodniki,SMALL(IF(numerki=$Q59,ROW(numerki)-ROW(I$4)+1),COUNTIF($Q$4:$Q59,$Q59)),COLUMNS($B$8:C63)))","v":""},{"$f":"IF($Q59=\"\",\"\",INDEX(zawodniki,SMALL(IF(numerki=$Q59,ROW(numerki)-ROW(J$4)+1),COUNTIF($Q$4:$Q59,$Q59)),COLUMNS($B$8:D63)))","v":""},{"$f":"IF($Q59=\"\",\"\",INDEX(zawodniki,SMALL(IF(numerki=$Q59,ROW(numerki)-ROW(K$4)+1),COUNTIF($Q$4:$Q59,$Q59)),COLUMNS($B$8:E63)))","v":""},{"$f":"IF(ROWS($L$144:L199)>COUNT(numerki),\"\",SMALL(numerki,ROWS($L$144:L199)))","v":""}]
[32,6,"LEŚNIAK Helena ",2009,"UKN LAWORTA Ustrzyki Dolne","Gr. 5",null,{"$f":"IF(G60=\"\",\"\",COUNTIF(G$4:G60,G60))","v":""},null,null,null,{"$f":"IF(Q60=\"\",\"\",SUBTOTAL(103,Q$4:Q60))","v":""},{"$f":"IF($Q60=\"\",\"\",INDEX(zawodniki,SMALL(IF(numerki=$Q60,ROW(numerki)-ROW(H$4)+1),COUNTIF($Q$4:$Q60,$Q60)),COLUMNS($B$8:B64)))","v":""},{"$f":"IF($Q60=\"\",\"\",INDEX(zawodniki,SMALL(IF(numerki=$Q60,ROW(numerki)-ROW(I$4)+1),COUNTIF($Q$4:$Q60,$Q60)),COLUMNS($B$8:C64)))","v":""},{"$f":"IF($Q60=\"\",\"\",INDEX(zawodniki,SMALL(IF(numerki=$Q60,ROW(numerki)-ROW(J$4)+1),COUNTIF($Q$4:$Q60,$Q60)),COLUMNS($B$8:D64)))","v":""},{"$f":"IF($Q60=\"\",\"\",INDEX(zawodniki,SMALL(IF(numerki=$Q60,ROW(numerki)-ROW(K$4)+1),COUNTIF($Q$4:$Q60,$Q60)),COLUMNS($B$8:E64)))","v":""},{"$f":"IF(ROWS($L$144:L200)>COUNT(numerki),\"\",SMALL(numerki,ROWS($L$144:L200)))","v":""}]
[47,4,"KĄDZIOŁKA Pola ",2007,"UKN LAWORTA Ustrzyki Dolne","Gr. 5",null,{"$f":"IF(G61=\"\",\"\",COUNTIF(G$4:G61,G61))","v":""},null,null,null,{"$f":"IF(Q61=\"\",\"\",SUBTOTAL(103,Q$4:Q61))","v":""},{"$f":"IF($Q61=\"\",\"\",INDEX(zawodniki,SMALL(IF(numerki=$Q61,ROW(numerki)-ROW(H$4)+1),COUNTIF($Q$4:$Q61,$Q61)),COLUMNS($B$8:B65)))","v":""},{"$f":"IF($Q61=\"\",\"\",INDEX(zawodniki,SMALL(IF(numerki=$Q61,ROW(numerki)-ROW(I$4)+1),COUNTIF($Q$4:$Q61,$Q61)),COLUMNS($B$8:C65)))","v":""},{"$f":"IF($Q61=\"\",\"\",INDEX(zawodniki,SMALL(IF(numerki=$Q61,ROW(numerki)-ROW(J$4)+1),COUNTIF($Q$4:$Q61,$Q61)),COLUMNS($B$8:D65)))","v":""},{"$f":"IF($Q61=\"\",\"\",INDEX(zawodniki,SMALL(IF(numerki=$Q61,ROW(numerki)-ROW(K$4)+1),COUNTIF($Q$4:$Q61,$Q61)),COLUMNS($B$8:E65)))","v":""},{"$f":"IF(ROWS($L$144:L201)>COUNT(numerki),\"\",SMALL(numerki,ROWS($L$144:L201)))","v":""}]
[48,6,"KOWALSKA Julia ",2008,"UKN LAWORTA Ustrzyki Dolne","Gr. 5",null,{"$f":"IF(G62=\"\",\"\",COUNTIF(G$4:G62,G62))","v":""},null,null,null,{"$f":"IF(Q62=\"\",\"\",SUBTOTAL(103,Q$4:Q62))","v":""},{"$f":"IF($Q62=\"\",\"\",INDEX(zawodniki,SMALL(IF(numerki=$Q62,ROW(numerki)-ROW(H$4)+1),COUNTIF($Q$4:$Q62,$Q62)),COLUMNS($B$8:B66)))","v":""},{"$f":"IF($Q62=\"\",\"\",INDEX(zawodniki,SMALL(IF(numerki=$Q62,ROW(numerki)-ROW(I$4)+1),COUNTIF($Q$4:$Q62,$Q62)),COLUMNS($B$8:C66)))","v":""},{"$f":"IF($Q62=\"\",\"\",INDEX(zawodniki,SMALL(IF(numerki=$Q62,ROW(numerki)-ROW(J$4)+1),COUNTIF($Q$4:$Q62,$Q62)),COLUMNS($B$8:D66)))","v":""},{"$f":"IF($Q62=\"\",\"\",INDEX(zawodniki,SMALL(IF(numerki=$Q62,ROW(numerki)-ROW(K$4)+1),COUNTIF($Q$4:$Q62,$Q62)),COLUMNS($B$8:E66)))","v":""},{"$f":"IF(ROWS($L$144:L202)>COUNT(numerki),\"\",SMALL(numerki,ROWS($L$144:L202)))","v":""}]
[49,7,"BAŁABAN Maria ",2007,"UKN LAWORTA Ustrzyki Dolne","Gr. 5",null,{"$f":"IF(G63=\"\",\"\",COUNTIF(G$4:G63,G63))","v":""},null,null,null,{"$f":"IF(Q63=\"\",\"\",SUBTOTAL(103,Q$4:Q63))","v":""},{"$f":"IF($Q63=\"\",\"\",INDEX(zawodniki,SMALL(IF(numerki=$Q63,ROW(numerki)-ROW(H$4)+1),COUNTIF($Q$4:$Q63,$Q63)),COLUMNS($B$8:B67)))","v":""},{"$f":"IF($Q63=\"\",\"\",INDEX(zawodniki,SMALL(IF(numerki=$Q63,ROW(numerki)-ROW(I$4)+1),COUNTIF($Q$4:$Q63,$Q63)),COLUMNS($B$8:C67)))","v":""},{"$f":"IF($Q63=\"\",\"\",INDEX(zawodniki,SMALL(IF(numerki=$Q63,ROW(numerki)-ROW(J$4)+1),COUNTIF($Q$4:$Q63,$Q63)),COLUMNS($B$8:D67)))","v":""},{"$f":"IF($Q63=\"\",\"\",INDEX(zawodniki,SMALL(IF(numerki=$Q63,ROW(numerki)-ROW(K$4)+1),COUNTIF($Q$4:$Q63,$Q63)),COLUMNS($B$8:E67)))","v":""},{"$f":"IF(ROWS($L$144:L203)>COUNT(numerki),\"\",SMALL(numerki,ROWS($L$144:L203)))","v":""}]
[50,9,"ELMERYCH Maria ",2008,"UKN LAWORTA Ustrzyki Dolne","Gr. 5",null,{"$f":"IF(G64=\"\",\"\",COUNTIF(G$4:G64,G64))","v":""},null,null,null,{"$f":"IF(Q64=\"\",\"\",SUBTOTAL(103,Q$4:Q64))","v":""},{"$f":"IF($Q64=\"\",\"\",INDEX(zawodniki,SMALL(IF(numerki=$Q64,ROW(numerki)-ROW(H$4)+1),COUNTIF($Q$4:$Q64,$Q64)),COLUMNS($B$8:B68)))","v":""},{"$f":"IF($Q64=\"\",\"\",INDEX(zawodniki,SMALL(IF(numerki=$Q64,ROW(numerki)-ROW(I$4)+1),COUNTIF($Q$4:$Q64,$Q64)),COLUMNS($B$8:C68)))","v":""},{"$f":"IF($Q64=\"\",\"\",INDEX(zawodniki,SMALL(IF(numerki=$Q64,ROW(numerki)-ROW(J$4)+1),COUNTIF($Q$4:$Q64,$Q64)),COLUMNS($B$8:D68)))","v":""},{"$f":"IF($Q64=\"\",\"\",INDEX(zawodniki,SMALL(IF(numerki=$Q64,ROW(numerki)-ROW(K$4)+1),COUNTIF($Q$4:$Q64,$Q64)),COLUMNS($B$8:E68)))","v":""},{"$f":"IF(ROWS($L$144:L204)>COUNT(numerki),\"\",SMALL(numerki,ROWS($L$144:L204)))","v":""}]
[92,8,"KULIGOWSKA Zofia ",2010,"UKS Śródmieście Przemyśl","Gr. 5",null,{"$f":"IF(G65=\"\",\"\",COUNTIF(G$4:G65,G65))","v":""},null,null,null,{"$f":"IF(Q65=\"\",\"\",SUBTOTAL(103,Q$4:Q65))","v":""},{"$f":"IF($Q65=\"\",\"\",INDEX(zawodniki,SMALL(IF(numerki=$Q65,ROW(numerki)-ROW(H$4)+1),COUNTIF($Q$4:$Q65,$Q65)),COLUMNS($B$8:B69)))","v":""},{"$f":"IF($Q65=\"\",\"\",INDEX(zawodniki,SMALL(IF(numerki=$Q65,ROW(numerki)-ROW(I$4)+1),COUNTIF($Q$4:$Q65,$Q65)),COLUMNS($B$8:C69)))","v":""},{"$f":"IF($Q65=\"\",\"\",INDEX(zawodniki,SMALL(IF(numerki=$Q65,ROW(numerki)-ROW(J$4)+1),COUNTIF($Q$4:$Q65,$Q65)),COLUMNS($B$8:D69)))","v":""},{"$f":"IF($Q65=\"\",\"\",INDEX(zawodniki,SMALL(IF(numerki=$Q65,ROW(numerki)-ROW(K$4)+1),COUNTIF($Q$4:$Q65,$Q65)),COLUMNS($B$8:E69)))","v":""},{"$f":"IF(ROWS($L$144:L205)>COUNT(numerki),\"\",SMALL(numerki,ROWS($L$144:L205)))","v":""}]
[15,1,"DOMAGALSKA Aleksandra ",2012,"KN Przemyśl SKI","Gr. 6",null,{"$f":"IF(G66=\"\",\"\",COUNTIF(G$4:G66,G66))","v":""},null,null,null,{"$f":"IF(Q66=\"\",\"\",SUBTOTAL(103,Q$4:Q66))","v":""},{"$f":"IF($Q66=\"\",\"\",INDEX(zawodniki,SMALL(IF(numerki=$Q66,ROW(numerki)-ROW(H$4)+1),COUNTIF($Q$4:$Q66,$Q66)),COLUMNS($B$8:B70)))","v":""},{"$f":"IF($Q66=\"\",\"\",INDEX(zawodniki,SMALL(IF(numerki=$Q66,ROW(numerki)-ROW(I$4)+1),COUNTIF($Q$4:$Q66,$Q66)),COLUMNS($B$8:C70)))","v":""},{"$f":"IF($Q66=\"\",\"\",INDEX(zawodniki,SMALL(IF(numerki=$Q66,ROW(numerki)-ROW(J$4)+1),COUNTIF($Q$4:$Q66,$Q66)),COLUMNS($B$8:D70)))","v":""},{"$f":"IF($Q66=\"\",\"\",INDEX(zawodniki,SMALL(IF(numerki=$Q66,ROW(numerki)-ROW(K$4)+1),COUNTIF($Q$4:$Q66,$Q66)),COLUMNS($B$8:E70)))","v":""},{"$f":"IF(ROWS($L$144:L206)>COUNT(numerki),\"\",SMALL(numerki,ROWS($L$144:L206)))","v":""}]
[16,5,"KOCHANOWICZ Nadia ",2012,"UKN LAWORTA Ustrzyki Dolne","Gr. 6",null,{"$f":"IF(G67=\"\",\"\",COUNTIF(G$4:G67,G67))","v":""},null,null,null,{"$f":"IF(Q67=\"\",\"\",SUBTOTAL(103,Q$4:Q67))","v":""},{"$f":"IF($Q67=\"\",\"\",INDEX(zawodniki,SMALL(IF(numerki=$Q67,ROW(numerki)-ROW(H$4)+1),COUNTIF($Q$4:$Q67,$Q67)),COLUMNS($B$8:B71)))","v":""},{"$f":"IF($Q67=\"\",\"\",INDEX(zawodniki,SMALL(IF(numerki=$Q67,ROW(numerki)-ROW(I$4)+1),COUNTIF($Q$4:$Q67,$Q67)),COLUMNS($B$8:C71)))","v":""},{"$f":"IF($Q67=\"\",\"\",INDEX(zawodniki,SMALL(IF(numerki=$Q67,ROW(numerki)-ROW(J$4)+1),COUNTIF($Q$4:$Q67,$Q67)),COLUMNS($B$8:D71)))","v":""},{"$f":"IF($Q67=\"\",\"\",INDEX(zawodniki,SMALL(IF(numerki=$Q67,ROW(numerki)-ROW(K$4)+1),COUNTIF($Q$4:$Q67,$Q67)),COLUMNS($B$8:E71)))","v":""},{"$f":"IF(ROWS($L$144:L207)>COUNT(numerki),\"\",SMALL(numerki,ROWS($L$144:L207)))","v":""}]
[23,7,"MIELNIK Fabian ",2012,"KN Przemyśl SKI","Gr. 6",null,{"$f":"IF(G68=\"\",\"\",COUNTIF(G$4:G68,G68))","v":""},null,null,null,{"$f":"IF(Q68=\"\",\"\",SUBTOTAL(103,Q$4:Q68))","v":""},{"$f":"IF($Q68=\"\",\"\",INDEX(zawodniki,SMALL(IF(numerki=$Q68,ROW(numerki)-ROW(H$4)+1),COUNTIF($Q$4:$Q68,$Q68)),COLUMNS($B$8:B72)))","v":""},{"$f":"IF($Q68=\"\",\"\",INDEX(zawodniki,SMALL(IF(numerki=$Q68,ROW(numerki)-ROW(I$4)+1),COUNTIF($Q$4:$Q68,$Q68)),COLUMNS($B$8:C72)))","v":""},{"$f":"IF($Q68=\"\",\"\",INDEX(zawodniki,SMALL(IF(numerki=$Q68,ROW(numerki)-ROW(J$4)+1),COUNTIF($Q$4:$Q68,$Q68)),COLUMNS($B$8:D72)))","v":""},{"$f":"IF($Q68=\"\",\"\",INDEX(zawodniki,SMALL(IF(numerki=$Q68,ROW(numerki)-ROW(K$4)+1),COUNTIF($Q$4:$Q68,$Q68)),COLUMNS($B$8:E72)))","v":""},{"$f":"IF(ROWS($L$144:L208)>COUNT(numerki),\"\",SMALL(numerki,ROWS($L$144:L208)))","v":""}]
[24,8,"BOCER Jakub ",2012,"UKS Śródmieście Przemyśl","Gr. 6",null,{"$f":"IF(G69=\"\",\"\",COUNTIF(G$4:G69,G69))","v":""},null,null,null,{"$f":"IF(Q69=\"\",\"\",SUBTOTAL(103,Q$4:Q69))","v":""},{"$f":"IF($Q69=\"\",\"\",INDEX(zawodniki,SMALL(IF(numerki=$Q69,ROW(numerki)-ROW(H$4)+1),COUNTIF($Q$4:$Q69,$Q69)),COLUMNS($B$8:B73)))","v":""},{"$f":"IF($Q69=\"\",\"\",INDEX(zawodniki,SMALL(IF(numerki=$Q69,ROW(numerki)-ROW(I$4)+1),COUNTIF($Q$4:$Q69,$Q69)),COLUMNS($B$8:C73)))","v":""},{"$f":"IF($Q69=\"\",\"\",INDEX(zawodniki,SMALL(IF(numerki=$Q69,ROW(numerki)-ROW(J$4)+1),COUNTIF($Q$4:$Q69,$Q69)),COLUMNS($B$8:D73)))","v":""},{"$f":"IF($Q69=\"\",\"\",INDEX(zawodniki,SMALL(IF(numerki=$Q69,ROW(numerki)-ROW(K$4)+1),COUNTIF($Q$4:$Q69,$Q69)),COLUMNS($B$8:E73)))","v":""},{"$f":"IF(ROWS($L$144:L209)>COUNT(numerki),\"\",SMALL(numerki,ROWS($L$144:L209)))","v":""}]
[27,3,"WRONA Filip ",2012,"UKN LAWORTA Ustrzyki Dolne","Gr. 6",null,{"$f":"IF(G70=\"\",\"\",COUNTIF(G$4:G70,G70))","v":""},null,null,null,{"$f":"IF(Q70=\"\",\"\",SUBTOTAL(103,Q$4:Q70))","v":""},{"$f":"IF($Q70=\"\",\"\",INDEX(zawodniki,SMALL(IF(numerki=$Q70,ROW(numerki)-ROW(H$4)+1),COUNTIF($Q$4:$Q70,$Q70)),COLUMNS($B$8:B74)))","v":""},{"$f":"IF($Q70=\"\",\"\",INDEX(zawodniki,SMALL(IF(numerki=$Q70,ROW(numerki)-ROW(I$4)+1),COUNTIF($Q$4:$Q70,$Q70)),COLUMNS($B$8:C74)))","v":""},{"$f":"IF($Q70=\"\",\"\",INDEX(zawodniki,SMALL(IF(numerki=$Q70,ROW(numerki)-ROW(J$4)+1),COUNTIF($Q$4:$Q70,$Q70)),COLUMNS($B$8:D74)))","v":""},{"$f":"IF($Q70=\"\",\"\",INDEX(zawodniki,SMALL(IF(numerki=$Q70,ROW(numerki)-ROW(K$4)+1),COUNTIF($Q$4:$Q70,$Q70)),COLUMNS($B$8:E74)))","v":""},{"$f":"IF(ROWS($L$144:L210)>COUNT(numerki),\"\",SMALL(numerki,ROWS($L$144:L210)))","v":""}]
[28,4,"KUŚMIDER Jagoda ",2010,"UKN LAWORTA Ustrzyki Dolne","Gr. 6",null,{"$f":"IF(G71=\"\",\"\",COUNTIF(G$4:G71,G71))","v":""},null,null,null,{"$f":"IF(Q71=\"\",\"\",SUBTOTAL(103,Q$4:Q71))","v":""},{"$f":"IF($Q71=\"\",\"\",INDEX(zawodniki,SMALL(IF(numerki=$Q71,ROW(numerki)-ROW(H$4)+1),COUNTIF($Q$4:$Q71,$Q71)),COLUMNS($B$8:B75)))","v":""},{"$f":"IF($Q71=\"\",\"\",INDEX(zawodniki,SMALL(IF(numerki=$Q71,ROW(numerki)-ROW(I$4)+1),COUNTIF($Q$4:$Q71,$Q71)),COLUMNS($B$8:C75)))","v":""},{"$f":"IF($Q71=\"\",\"\",INDEX(zawodniki,SMALL(IF(numerki=$Q71,ROW(numerki)-ROW(J$4)+1),COUNTIF($Q$4:$Q71,$Q71)),COLUMNS($B$8:D75)))","v":""},{"$f":"IF($Q71=\"\",\"\",INDEX(zawodniki,SMALL(IF(numerki=$Q71,ROW(numerki)-ROW(K$4)+1),COUNTIF($Q$4:$Q71,$Q71)),COLUMNS($B$8:E75)))","v":""},{"$f":"IF(ROWS($L$144:L211)>COUNT(numerki),\"\",SMALL(numerki,ROWS($L$144:L211)))","v":""}]
[51,2,"KOCHANOWICZ Blanka ",2008,"UKN LAWORTA Ustrzyki Dolne","Gr. 6",null,{"$f":"IF(G72=\"\",\"\",COUNTIF(G$4:G72,G72))","v":""},null,null,null,{"$f":"IF(Q72=\"\",\"\",SUBTOTAL(103,Q$4:Q72))","v":""},{"$f":"IF($Q72=\"\",\"\",INDEX(zawodniki,SMALL(IF(numerki=$Q72,ROW(numerki)-ROW(H$4)+1),COUNTIF($Q$4:$Q72,$Q72)),COLUMNS($B$8:B76)))","v":""},{"$f":"IF($Q72=\"\",\"\",INDEX(zawodniki,SMALL(IF(numerki=$Q72,ROW(numerki)-ROW(I$4)+1),COUNTIF($Q$4:$Q72,$Q72)),COLUMNS($B$8:C76)))","v":""},{"$f":"IF($Q72=\"\",\"\",INDEX(zawodniki,SMALL(IF(numerki=$Q72,ROW(numerki)-ROW(J$4)+1),COUNTIF($Q$4:$Q72,$Q72)),COLUMNS($B$8:D76)))","v":""},{"$f":"IF($Q72=\"\",\"\",INDEX(zawodniki,SMALL(IF(numerki=$Q72,ROW(numerki)-ROW(K$4)+1),COUNTIF($Q$4:$Q72,$Q72)),COLUMNS($B$8:E76)))","v":""},{"$f":"IF(ROWS($L$144:L212)>COUNT(numerki),\"\",SMALL(numerki,ROWS($L$144:L212)))","v":""}]
[52,6,"STRUSIEWICZ Julia ",2007,"UKN LAWORTA Ustrzyki Dolne","Gr. 6",null,{"$f":"IF(G73=\"\",\"\",COUNTIF(G$4:G73,G73))","v":""},null,null,null,{"$f":"IF(Q73=\"\",\"\",SUBTOTAL(103,Q$4:Q73))","v":""},{"$f":"IF($Q73=\"\",\"\",INDEX(zawodniki,SMALL(IF(numerki=$Q73,ROW(numerki)-ROW(H$4)+1),COUNTIF($Q$4:$Q73,$Q73)),COLUMNS($B$8:B77)))","v":""},{"$f":"IF($Q73=\"\",\"\",INDEX(zawodniki,SMALL(IF(numerki=$Q73,ROW(numerki)-ROW(I$4)+1),COUNTIF($Q$4:$Q73,$Q73)),COLUMNS($B$8:C77)))","v":""},{"$f":"IF($Q73=\"\",\"\",INDEX(zawodniki,SMALL(IF(numerki=$Q73,ROW(numerki)-ROW(J$4)+1),COUNTIF($Q$4:$Q73,$Q73)),COLUMNS($B$8:D77)))","v":""},{"$f":"IF($Q73=\"\",\"\",INDEX(zawodniki,SMALL(IF(numerki=$Q73,ROW(numerki)-ROW(K$4)+1),COUNTIF($Q$4:$Q73,$Q73)),COLUMNS($B$8:E77)))","v":""},{"$f":"IF(ROWS($L$144:L213)>COUNT(numerki),\"\",SMALL(numerki,ROWS($L$144:L213)))","v":""}]
[17,6,"MUCHA Zofia ",2012,"UKN LAWORTA Ustrzyki Dolne","Gr. 7",null,{"$f":"IF(G74=\"\",\"\",COUNTIF(G$4:G74,G74))","v":""},null,null,null,{"$f":"IF(Q74=\"\",\"\",SUBTOTAL(103,Q$4:Q74))","v":""},{"$f":"IF($Q74=\"\",\"\",INDEX(zawodniki,SMALL(IF(numerki=$Q74,ROW(numerki)-ROW(H$4)+1),COUNTIF($Q$4:$Q74,$Q74)),COLUMNS($B$8:B78)))","v":""},{"$f":"IF($Q74=\"\",\"\",INDEX(zawodniki,SMALL(IF(numerki=$Q74,ROW(numerki)-ROW(I$4)+1),COUNTIF($Q$4:$Q74,$Q74)),COLUMNS($B$8:C78)))","v":""},{"$f":"IF($Q74=\"\",\"\",INDEX(zawodniki,SMALL(IF(numerki=$Q74,ROW(numerki)-ROW(J$4)+1),COUNTIF($Q$4:$Q74,$Q74)),COLUMNS($B$8:D78)))","v":""},{"$f":"IF($Q74=\"\",\"\",INDEX(zawodniki,SMALL(IF(numerki=$Q74,ROW(numerki)-ROW(K$4)+1),COUNTIF($Q$4:$Q74,$Q74)),COLUMNS($B$8:E78)))","v":""},{"$f":"IF(ROWS($L$144:L214)>COUNT(numerki),\"\",SMALL(numerki,ROWS($L$144:L214)))","v":""}]
[18,11,"KOLII Myroslava ",2012,"UKS Śródmieście Przemyśl","Gr. 7",null,{"$f":"IF(G75=\"\",\"\",COUNTIF(G$4:G75,G75))","v":""},null,null,null,{"$f":"IF(Q75=\"\",\"\",SUBTOTAL(103,Q$4:Q75))","v":""},{"$f":"IF($Q75=\"\",\"\",INDEX(zawodniki,SMALL(IF(numerki=$Q75,ROW(numerki)-ROW(H$4)+1),COUNTIF($Q$4:$Q75,$Q75)),COLUMNS($B$8:B79)))","v":""},{"$f":"IF($Q75=\"\",\"\",INDEX(zawodniki,SMALL(IF(numerki=$Q75,ROW(numerki)-ROW(I$4)+1),COUNTIF($Q$4:$Q75,$Q75)),COLUMNS($B$8:C79)))","v":""},{"$f":"IF($Q75=\"\",\"\",INDEX(zawodniki,SMALL(IF(numerki=$Q75,ROW(numerki)-ROW(J$4)+1),COUNTIF($Q$4:$Q75,$Q75)),COLUMNS($B$8:D79)))","v":""},{"$f":"IF($Q75=\"\",\"\",INDEX(zawodniki,SMALL(IF(numerki=$Q75,ROW(numerki)-ROW(K$4)+1),COUNTIF($Q$4:$Q75,$Q75)),COLUMNS($B$8:E79)))","v":""},{"$f":"IF(ROWS($L$144:L215)>COUNT(numerki),\"\",SMALL(numerki,ROWS($L$144:L215)))","v":""}]
[53,1,"SOWA Nikola ",2007,"KN Przemyśl SKI","Gr. 7",null,{"$f":"IF(G76=\"\",\"\",COUNTIF(G$4:G76,G76))","v":""},null,null,null,{"$f":"IF(Q76=\"\",\"\",SUBTOTAL(103,Q$4:Q76))","v":""},{"$f":"IF($Q76=\"\",\"\",INDEX(zawodniki,SMALL(IF(numerki=$Q76,ROW(numerki)-ROW(H$4)+1),COUNTIF($Q$4:$Q76,$Q76)),COLUMNS($B$8:B80)))","v":""},{"$f":"IF($Q76=\"\",\"\",INDEX(zawodniki,SMALL(IF(numerki=$Q76,ROW(numerki)-ROW(I$4)+1),COUNTIF($Q$4:$Q76,$Q76)),COLUMNS($B$8:C80)))","v":""},{"$f":"IF($Q76=\"\",\"\",INDEX(zawodniki,SMALL(IF(numerki=$Q76,ROW(numerki)-ROW(J$4)+1),COUNTIF($Q$4:$Q76,$Q76)),COLUMNS($B$8:D80)))","v":""},{"$f":"IF($Q76=\"\",\"\",INDEX(zawodniki,SMALL(IF(numerki=$Q76,ROW(numerki)-ROW(K$4)+1),COUNTIF($Q$4:$Q76,$Q76)),COLUMNS($B$8:E80)))","v":""},{"$f":"IF(ROWS($L$144:L216)>COUNT(numerki),\"\",SMALL(numerki,ROWS($L$144:L216)))","v":""}]
[54,2,"DZIWISZ Julia ",2008,"UKN LAWORTA Ustrzyki Dolne","Gr. 7",null,{"$f":"IF(G77=\"\",\"\",COUNTIF(G$4:G77,G77))","v":""},null,null,null,{"$f":"IF(Q77=\"\",\"\",SUBTOTAL(103,Q$4:Q77))","v":""},{"$f":"IF($Q77=\"\",\"\",INDEX(zawodniki,SMALL(IF(numerki=$Q77,ROW(numerki)-ROW(H$4)+1),COUNTIF($Q$4:$Q77,$Q77)),COLUMNS($B$8:B81)))","v":""},{"$f":"IF($Q77=\"\",\"\",INDEX(zawodniki,SMALL(IF(numerki=$Q77,ROW(numerki)-ROW(I$4)+1),COUNTIF($Q$4:$Q77,$Q77)),COLUMNS($B$8:C81)))","v":""},{"$f":"IF($Q77=\"\",\"\",INDEX(zawodniki,SMALL(IF(numerki=$Q77,ROW(numerki)-ROW(J$4)+1),COUNTIF($Q$4:$Q77,$Q77)),COLUMNS($B$8:D81)))","v":""},{"$f":"IF($Q77=\"\",\"\",INDEX(zawodniki,SMALL(IF(numerki=$Q77,ROW(numerki)-ROW(K$4)+1),COUNTIF($Q$4:$Q77,$Q77)),COLUMNS($B$8:E81)))","v":""},{"$f":"IF(ROWS($L$144:L217)>COUNT(numerki),\"\",SMALL(numerki,ROWS($L$144:L217)))","v":""}]
[55,3,"DACKO Pola ",2008,"UKN LAWORTA Ustrzyki Dolne","Gr. 7",null,{"$f":"IF(G78=\"\",\"\",COUNTIF(G$4:G78,G78))","v":""},null,null,null,{"$f":"IF(Q78=\"\",\"\",SUBTOTAL(103,Q$4:Q78))","v":""},{"$f":"IF($Q78=\"\",\"\",INDEX(zawodniki,SMALL(IF(numerki=$Q78,ROW(numerki)-ROW(H$4)+1),COUNTIF($Q$4:$Q78,$Q78)),COLUMNS($B$8:B82)))","v":""},{"$f":"IF($Q78=\"\",\"\",INDEX(zawodniki,SMALL(IF(numerki=$Q78,ROW(numerki)-ROW(I$4)+1),COUNTIF($Q$4:$Q78,$Q78)),COLUMNS($B$8:C82)))","v":""},{"$f":"IF($Q78=\"\",\"\",INDEX(zawodniki,SMALL(IF(numerki=$Q78,ROW(numerki)-ROW(J$4)+1),COUNTIF($Q$4:$Q78,$Q78)),COLUMNS($B$8:D82)))","v":""},{"$f":"IF($Q78=\"\",\"\",INDEX(zawodniki,SMALL(IF(numerki=$Q78,ROW(numerki)-ROW(K$4)+1),COUNTIF($Q$4:$Q78,$Q78)),COLUMNS($B$8:E82)))","v":""},{"$f":"IF(ROWS($L$144:L218)>COUNT(numerki),\"\",SMALL(numerki,ROWS($L$144:L218)))","v":""}]
[56,4,"KĘSICKA Lilianna ",2007,"KN Przemyśl SKI","Gr. 7",null,{"$f":"IF(G79=\"\",\"\",COUNTIF(G$4:G79,G79))","v":""},null,null,null,{"$f":"IF(Q79=\"\",\"\",SUBTOTAL(103,Q$4:Q79))","v":""},{"$f":"IF($Q79=\"\",\"\",INDEX(zawodniki,SMALL(IF(numerki=$Q79,ROW(numerki)-ROW(H$4)+1),COUNTIF($Q$4:$Q79,$Q79)),COLUMNS($B$8:B83)))","v":""},{"$f":"IF($Q79=\"\",\"\",INDEX(zawodniki,SMALL(IF(numerki=$Q79,ROW(numerki)-ROW(I$4)+1),COUNTIF($Q$4:$Q79,$Q79)),COLUMNS($B$8:C83)))","v":""},{"$f":"IF($Q79=\"\",\"\",INDEX(zawodniki,SMALL(IF(numerki=$Q79,ROW(numerki)-ROW(J$4)+1),COUNTIF($Q$4:$Q79,$Q79)),COLUMNS($B$8:D83)))","v":""},{"$f":"IF($Q79=\"\",\"\",INDEX(zawodniki,SMALL(IF(numerki=$Q79,ROW(numerki)-ROW(K$4)+1),COUNTIF($Q$4:$Q79,$Q79)),COLUMNS($B$8:E83)))","v":""},{"$f":"IF(ROWS($L$144:L219)>COUNT(numerki),\"\",SMALL(numerki,ROWS($L$144:L219)))","v":""}]
[57,5,"BERNAT Karol ",2007,"KN Gondola Krynica","Gr. 7",null,{"$f":"IF(G80=\"\",\"\",COUNTIF(G$4:G80,G80))","v":""},null,null,null,{"$f":"IF(Q80=\"\",\"\",SUBTOTAL(103,Q$4:Q80))","v":""},{"$f":"IF($Q80=\"\",\"\",INDEX(zawodniki,SMALL(IF(numerki=$Q80,ROW(numerki)-ROW(H$4)+1),COUNTIF($Q$4:$Q80,$Q80)),COLUMNS($B$8:B84)))","v":""},{"$f":"IF($Q80=\"\",\"\",INDEX(zawodniki,SMALL(IF(numerki=$Q80,ROW(numerki)-ROW(I$4)+1),COUNTIF($Q$4:$Q80,$Q80)),COLUMNS($B$8:C84)))","v":""},{"$f":"IF($Q80=\"\",\"\",INDEX(zawodniki,SMALL(IF(numerki=$Q80,ROW(numerki)-ROW(J$4)+1),COUNTIF($Q$4:$Q80,$Q80)),COLUMNS($B$8:D84)))","v":""},{"$f":"IF($Q80=\"\",\"\",INDEX(zawodniki,SMALL(IF(numerki=$Q80,ROW(numerki)-ROW(K$4)+1),COUNTIF($Q$4:$Q80,$Q80)),COLUMNS($B$8:E84)))","v":""},{"$f":"IF(ROWS($L$144:L220)>COUNT(numerki),\"\",SMALL(numerki,ROWS($L$144:L220)))","v":""}]
[58,7,"WIEJOWSKI Michał ",2008,"KN Gondola Krynica","Gr. 7",null,{"$f":"IF(G81=\"\",\"\",COUNTIF(G$4:G81,G81))","v":""},null,null,null,{"$f":"IF(Q81=\"\",\"\",SUBTOTAL(103,Q$4:Q81))","v":""},{"$f":"IF($Q81=\"\",\"\",INDEX(zawodniki,SMALL(IF(numerki=$Q81,ROW(numerki)-ROW(H$4)+1),COUNTIF($Q$4:$Q81,$Q81)),COLUMNS($B$8:B85)))","v":""},{"$f":"IF($Q81=\"\",\"\",INDEX(zawodniki,SMALL(IF(numerki=$Q81,ROW(numerki)-ROW(I$4)+1),COUNTIF($Q$4:$Q81,$Q81)),COLUMNS($B$8:C85)))","v":""},{"$f":"IF($Q81=\"\",\"\",INDEX(zawodniki,SMALL(IF(numerki=$Q81,ROW(numerki)-ROW(J$4)+1),COUNTIF($Q$4:$Q81,$Q81)),COLUMNS($B$8:D85)))","v":""},{"$f":"IF($Q81=\"\",\"\",INDEX(zawodniki,SMALL(IF(numerki=$Q81,ROW(numerki)-ROW(K$4)+1),COUNTIF($Q$4:$Q81,$Q81)),COLUMNS($B$8:E85)))","v":""},{"$f":"IF(ROWS($L$144:L221)>COUNT(numerki),\"\",SMALL(numerki,ROWS($L$144:L221)))","v":""}]
[59,8,"JUCOS Piotr ",2008,"UKN LAWORTA Ustrzyki Dolne","Gr. 7",null,{"$f":"IF(G82=\"\",\"\",COUNTIF(G$4:G82,G82))","v":""},null,null,null,{"$f":"IF(Q82=\"\",\"\",SUBTOTAL(103,Q$4:Q82))","v":""},{"$f":"IF($Q82=\"\",\"\",INDEX(zawodniki,SMALL(IF(numerki=$Q82,ROW(numerki)-ROW(H$4)+1),COUNTIF($Q$4:$Q82,$Q82)),COLUMNS($B$8:B86)))","v":""},{"$f":"IF($Q82=\"\",\"\",INDEX(zawodniki,SMALL(IF(numerki=$Q82,ROW(numerki)-ROW(I$4)+1),COUNTIF($Q$4:$Q82,$Q82)),COLUMNS($B$8:C86)))","v":""},{"$f":"IF($Q82=\"\",\"\",INDEX(zawodniki,SMALL(IF(numerki=$Q82,ROW(numerki)-ROW(J$4)+1),COUNTIF($Q$4:$Q82,$Q82)),COLUMNS($B$8:D86)))","v":""},{"$f":"IF($Q82=\"\",\"\",INDEX(zawodniki,SMALL(IF(numerki=$Q82,ROW(numerki)-ROW(K$4)+1),COUNTIF($Q$4:$Q82,$Q82)),COLUMNS($B$8:E86)))","v":""},{"$f":"IF(ROWS($L$144:L222)>COUNT(numerki),\"\",SMALL(numerki,ROWS($L$144:L222)))","v":""}]
[60,9,"KRYDA Mikołaj ",2008,"UKN LAWORTA Ustrzyki Dolne","Gr. 7",null,{"$f":"IF(G83=\"\",\"\",COUNTIF(G$4:G83,G83))","v":""},null,null,null,{"$f":"IF(Q83=\"\",\"\",SUBTOTAL(103,Q$4:Q83))","v":""},{"$f":"IF($Q83=\"\",\"\",INDEX(zawodniki,SMALL(IF(numerki=$Q83,ROW(numerki)-ROW(H$4)+1),COUNTIF($Q$4:$Q83,$Q83)),COLUMNS($B$8:B87)))","v":""},{"$f":"IF($Q83=\"\",\"\",INDEX(zawodniki,SMALL(IF(numerki=$Q83,ROW(numerki)-ROW(I$4)+1),COUNTIF($Q$4:$Q83,$Q83)),COLUMNS($B$8:C87)))","v":""},{"$f":"IF($Q83=\"\",\"\",INDEX(zawodniki,SMALL(IF(numerki=$Q83,ROW(numerki)-ROW(J$4)+1),COUNTIF($Q$4:$Q83,$Q83)),COLUMNS($B$8:D87)))","v":""},{"$f":"IF($Q83=\"\",\"\",INDEX(zawodniki,SMALL(IF(numerki=$Q83,ROW(numerki)-ROW(K$4)+1),COUNTIF($Q$4:$Q83,$Q83)),COLUMNS($B$8:E87)))","v":""},{"$f":"IF(ROWS($L$144:L223)>COUNT(numerki),\"\",SMALL(numerki,ROWS($L$144:L223)))","v":""}]
[61,10,"TŁUCZEK Kasper ",2007,"KN Przemyśl SKI","Gr. 7",null,{"$f":"IF(G84=\"\",\"\",COUNTIF(G$4:G84,G84))","v":""},null,null,null,{"$f":"IF(Q84=\"\",\"\",SUBTOTAL(103,Q$4:Q84))","v":""},{"$f":"IF($Q84=\"\",\"\",INDEX(zawodniki,SMALL(IF(numerki=$Q84,ROW(numerki)-ROW(H$4)+1),COUNTIF($Q$4:$Q84,$Q84)),COLUMNS($B$8:B88)))","v":""},{"$f":"IF($Q84=\"\",\"\",INDEX(zawodniki,SMALL(IF(numerki=$Q84,ROW(numerki)-ROW(I$4)+1),COUNTIF($Q$4:$Q84,$Q84)),COLUMNS($B$8:C88)))","v":""},{"$f":"IF($Q84=\"\",\"\",INDEX(zawodniki,SMALL(IF(numerki=$Q84,ROW(numerki)-ROW(J$4)+1),COUNTIF($Q$4:$Q84,$Q84)),COLUMNS($B$8:D88)))","v":""},{"$f":"IF($Q84=\"\",\"\",INDEX(zawodniki,SMALL(IF(numerki=$Q84,ROW(numerki)-ROW(K$4)+1),COUNTIF($Q$4:$Q84,$Q84)),COLUMNS($B$8:E88)))","v":""},{"$f":"IF(ROWS($L$144:L224)>COUNT(numerki),\"\",SMALL(numerki,ROWS($L$144:L224)))","v":""}]
[62,12,"BIERNACKI Kacper ",2008,"SKN Jasło przy ZSM Nr 1","Gr. 7",null,{"$f":"IF(G85=\"\",\"\",COUNTIF(G$4:G85,G85))","v":""},null,null,null,{"$f":"IF(Q85=\"\",\"\",SUBTOTAL(103,Q$4:Q85))","v":""},{"$f":"IF($Q85=\"\",\"\",INDEX(zawodniki,SMALL(IF(numerki=$Q85,ROW(numerki)-ROW(H$4)+1),COUNTIF($Q$4:$Q85,$Q85)),COLUMNS($B$8:B89)))","v":""},{"$f":"IF($Q85=\"\",\"\",INDEX(zawodniki,SMALL(IF(numerki=$Q85,ROW(numerki)-ROW(I$4)+1),COUNTIF($Q$4:$Q85,$Q85)),COLUMNS($B$8:C89)))","v":""},{"$f":"IF($Q85=\"\",\"\",INDEX(zawodniki,SMALL(IF(numerki=$Q85,ROW(numerki)-ROW(J$4)+1),COUNTIF($Q$4:$Q85,$Q85)),COLUMNS($B$8:D89)))","v":""},{"$f":"IF($Q85=\"\",\"\",INDEX(zawodniki,SMALL(IF(numerki=$Q85,ROW(numerki)-ROW(K$4)+1),COUNTIF($Q$4:$Q85,$Q85)),COLUMNS($B$8:E89)))","v":""},{"$f":"IF(ROWS($L$144:L225)>COUNT(numerki),\"\",SMALL(numerki,ROWS($L$144:L225)))","v":""}]
[4,1,"MOSUREK Zofia ",2013,"UKN LAWORTA Ustrzyki Dolne","Gr. 8",null,{"$f":"IF(G86=\"\",\"\",COUNTIF(G$4:G86,G86))","v":""},null,null,null,{"$f":"IF(Q86=\"\",\"\",SUBTOTAL(103,Q$4:Q86))","v":""},{"$f":"IF($Q86=\"\",\"\",INDEX(zawodniki,SMALL(IF(numerki=$Q86,ROW(numerki)-ROW(H$4)+1),COUNTIF($Q$4:$Q86,$Q86)),COLUMNS($B$8:B90)))","v":""},{"$f":"IF($Q86=\"\",\"\",INDEX(zawodniki,SMALL(IF(numerki=$Q86,ROW(numerki)-ROW(I$4)+1),COUNTIF($Q$4:$Q86,$Q86)),COLUMNS($B$8:C90)))","v":""},{"$f":"IF($Q86=\"\",\"\",INDEX(zawodniki,SMALL(IF(numerki=$Q86,ROW(numerki)-ROW(J$4)+1),COUNTIF($Q$4:$Q86,$Q86)),COLUMNS($B$8:D90)))","v":""},{"$f":"IF($Q86=\"\",\"\",INDEX(zawodniki,SMALL(IF(numerki=$Q86,ROW(numerki)-ROW(K$4)+1),COUNTIF($Q$4:$Q86,$Q86)),COLUMNS($B$8:E90)))","v":""},{"$f":"IF(ROWS($L$144:L226)>COUNT(numerki),\"\",SMALL(numerki,ROWS($L$144:L226)))","v":""}]
[5,2,"MOSUREK Marcelina ",2013,"UKN LAWORTA Ustrzyki Dolne","Gr. 8",null,{"$f":"IF(G87=\"\",\"\",COUNTIF(G$4:G87,G87))","v":""},null,null,null,{"$f":"IF(Q87=\"\",\"\",SUBTOTAL(103,Q$4:Q87))","v":""},{"$f":"IF($Q87=\"\",\"\",INDEX(zawodniki,SMALL(IF(numerki=$Q87,ROW(numerki)-ROW(H$4)+1),COUNTIF($Q$4:$Q87,$Q87)),COLUMNS($B$8:B91)))","v":""},{"$f":"IF($Q87=\"\",\"\",INDEX(zawodniki,SMALL(IF(numerki=$Q87,ROW(numerki)-ROW(I$4)+1),COUNTIF($Q$4:$Q87,$Q87)),COLUMNS($B$8:C91)))","v":""},{"$f":"IF($Q87=\"\",\"\",INDEX(zawodniki,SMALL(IF(numerki=$Q87,ROW(numerki)-ROW(J$4)+1),COUNTIF($Q$4:$Q87,$Q87)),COLUMNS($B$8:D91)))","v":""},{"$f":"IF($Q87=\"\",\"\",INDEX(zawodniki,SMALL(IF(numerki=$Q87,ROW(numerki)-ROW(K$4)+1),COUNTIF($Q$4:$Q87,$Q87)),COLUMNS($B$8:E91)))","v":""},{"$f":"IF(ROWS($L$144:L227)>COUNT(numerki),\"\",SMALL(numerki,ROWS($L$144:L227)))","v":""}]
[19,5,"LEŚNIAK Zuzanna ",2011,"UKN LAWORTA Ustrzyki Dolne","Gr. 8",null,{"$f":"IF(G88=\"\",\"\",COUNTIF(G$4:G88,G88))","v":""},null,null,null,{"$f":"IF(Q88=\"\",\"\",SUBTOTAL(103,Q$4:Q88))","v":""},{"$f":"IF($Q88=\"\",\"\",INDEX(zawodniki,SMALL(IF(numerki=$Q88,ROW(numerki)-ROW(H$4)+1),COUNTIF($Q$4:$Q88,$Q88)),COLUMNS($B$8:B92)))","v":""},{"$f":"IF($Q88=\"\",\"\",INDEX(zawodniki,SMALL(IF(numerki=$Q88,ROW(numerki)-ROW(I$4)+1),COUNTIF($Q$4:$Q88,$Q88)),COLUMNS($B$8:C92)))","v":""},{"$f":"IF($Q88=\"\",\"\",INDEX(zawodniki,SMALL(IF(numerki=$Q88,ROW(numerki)-ROW(J$4)+1),COUNTIF($Q$4:$Q88,$Q88)),COLUMNS($B$8:D92)))","v":""},{"$f":"IF($Q88=\"\",\"\",INDEX(zawodniki,SMALL(IF(numerki=$Q88,ROW(numerki)-ROW(K$4)+1),COUNTIF($Q$4:$Q88,$Q88)),COLUMNS($B$8:E92)))","v":""},{"$f":"IF(ROWS($L$144:L228)>COUNT(numerki),\"\",SMALL(numerki,ROWS($L$144:L228)))","v":""}]
[29,6,"BERNAT Kaja ",2010,"KN Gondola Krynica","Gr. 8",null,{"$f":"IF(G89=\"\",\"\",COUNTIF(G$4:G89,G89))","v":""},null,null,null,{"$f":"IF(Q89=\"\",\"\",SUBTOTAL(103,Q$4:Q89))","v":""},{"$f":"IF($Q89=\"\",\"\",INDEX(zawodniki,SMALL(IF(numerki=$Q89,ROW(numerki)-ROW(H$4)+1),COUNTIF($Q$4:$Q89,$Q89)),COLUMNS($B$8:B93)))","v":""},{"$f":"IF($Q89=\"\",\"\",INDEX(zawodniki,SMALL(IF(numerki=$Q89,ROW(numerki)-ROW(I$4)+1),COUNTIF($Q$4:$Q89,$Q89)),COLUMNS($B$8:C93)))","v":""},{"$f":"IF($Q89=\"\",\"\",INDEX(zawodniki,SMALL(IF(numerki=$Q89,ROW(numerki)-ROW(J$4)+1),COUNTIF($Q$4:$Q89,$Q89)),COLUMNS($B$8:D93)))","v":""},{"$f":"IF($Q89=\"\",\"\",INDEX(zawodniki,SMALL(IF(numerki=$Q89,ROW(numerki)-ROW(K$4)+1),COUNTIF($Q$4:$Q89,$Q89)),COLUMNS($B$8:E93)))","v":""},{"$f":"IF(ROWS($L$144:L229)>COUNT(numerki),\"\",SMALL(numerki,ROWS($L$144:L229)))","v":""}]
[63,3,"KRYDA Mikołam ",2008,"UKN LAWORTA Ustrzyki Dolne","Gr. 8",null,{"$f":"IF(G90=\"\",\"\",COUNTIF(G$4:G90,G90))","v":""},null,null,null,{"$f":"IF(Q90=\"\",\"\",SUBTOTAL(103,Q$4:Q90))","v":""},{"$f":"IF($Q90=\"\",\"\",INDEX(zawodniki,SMALL(IF(numerki=$Q90,ROW(numerki)-ROW(H$4)+1),COUNTIF($Q$4:$Q90,$Q90)),COLUMNS($B$8:B94)))","v":""},{"$f":"IF($Q90=\"\",\"\",INDEX(zawodniki,SMALL(IF(numerki=$Q90,ROW(numerki)-ROW(I$4)+1),COUNTIF($Q$4:$Q90,$Q90)),COLUMNS($B$8:C94)))","v":""},{"$f":"IF($Q90=\"\",\"\",INDEX(zawodniki,SMALL(IF(numerki=$Q90,ROW(numerki)-ROW(J$4)+1),COUNTIF($Q$4:$Q90,$Q90)),COLUMNS($B$8:D94)))","v":""},{"$f":"IF($Q90=\"\",\"\",INDEX(zawodniki,SMALL(IF(numerki=$Q90,ROW(numerki)-ROW(K$4)+1),COUNTIF($Q$4:$Q90,$Q90)),COLUMNS($B$8:E94)))","v":""},{"$f":"IF(ROWS($L$144:L230)>COUNT(numerki),\"\",SMALL(numerki,ROWS($L$144:L230)))","v":""}]
[64,4,"KOWALSKI Kamil ",2008,"UKN LAWORTA Ustrzyki Dolne","Gr. 8",null,{"$f":"IF(G91=\"\",\"\",COUNTIF(G$4:G91,G91))","v":""},null,null,null,{"$f":"IF(Q91=\"\",\"\",SUBTOTAL(103,Q$4:Q91))","v":""},{"$f":"IF($Q91=\"\",\"\",INDEX(zawodniki,SMALL(IF(numerki=$Q91,ROW(numerki)-ROW(H$4)+1),COUNTIF($Q$4:$Q91,$Q91)),COLUMNS($B$8:B95)))","v":""},{"$f":"IF($Q91=\"\",\"\",INDEX(zawodniki,SMALL(IF(numerki=$Q91,ROW(numerki)-ROW(I$4)+1),COUNTIF($Q$4:$Q91,$Q91)),COLUMNS($B$8:C95)))","v":""},{"$f":"IF($Q91=\"\",\"\",INDEX(zawodniki,SMALL(IF(numerki=$Q91,ROW(numerki)-ROW(J$4)+1),COUNTIF($Q$4:$Q91,$Q91)),COLUMNS($B$8:D95)))","v":""},{"$f":"IF($Q91=\"\",\"\",INDEX(zawodniki,SMALL(IF(numerki=$Q91,ROW(numerki)-ROW(K$4)+1),COUNTIF($Q$4:$Q91,$Q91)),COLUMNS($B$8:E95)))","v":""},{"$f":"IF(ROWS($L$144:L231)>COUNT(numerki),\"\",SMALL(numerki,ROWS($L$144:L231)))","v":""}]
[65,7,"WĘGLOWSKA Laura ",2005,"UKN LAWORTA Ustrzyki Dolne","Gr. 8","x",{"$f":"IF(G92=\"\",\"\",COUNTIF(G$4:G92,G92))","v":3},null,null,null,{"$f":"IF(Q92=\"\",\"\",SUBTOTAL(103,Q$4:Q92))","v":""},{"$f":"IF($Q92=\"\",\"\",INDEX(zawodniki,SMALL(IF(numerki=$Q92,ROW(numerki)-ROW(H$4)+1),COUNTIF($Q$4:$Q92,$Q92)),COLUMNS($B$8:B96)))","v":""},{"$f":"IF($Q92=\"\",\"\",INDEX(zawodniki,SMALL(IF(numerki=$Q92,ROW(numerki)-ROW(I$4)+1),COUNTIF($Q$4:$Q92,$Q92)),COLUMNS($B$8:C96)))","v":""},{"$f":"IF($Q92=\"\",\"\",INDEX(zawodniki,SMALL(IF(numerki=$Q92,ROW(numerki)-ROW(J$4)+1),COUNTIF($Q$4:$Q92,$Q92)),COLUMNS($B$8:D96)))","v":""},{"$f":"IF($Q92=\"\",\"\",INDEX(zawodniki,SMALL(IF(numerki=$Q92,ROW(numerki)-ROW(K$4)+1),COUNTIF($Q$4:$Q92,$Q92)),COLUMNS($B$8:E96)))","v":""},{"$f":"IF(ROWS($L$144:L232)>COUNT(numerki),\"\",SMALL(numerki,ROWS($L$144:L232)))","v":""}]
[66,8,"KUTER Katarzyna ",2005,"UKN LAWORTA Ustrzyki Dolne","Gr. 8",null,{"$f":"IF(G93=\"\",\"\",COUNTIF(G$4:G93,G93))","v":""},null,null,null,{"$f":"IF(Q93=\"\",\"\",SUBTOTAL(103,Q$4:Q93))","v":""},{"$f":"IF($Q93=\"\",\"\",INDEX(zawodniki,SMALL(IF(numerki=$Q93,ROW(numerki)-ROW(H$4)+1),COUNTIF($Q$4:$Q93,$Q93)),COLUMNS($B$8:B97)))","v":""},{"$f":"IF($Q93=\"\",\"\",INDEX(zawodniki,SMALL(IF(numerki=$Q93,ROW(numerki)-ROW(I$4)+1),COUNTIF($Q$4:$Q93,$Q93)),COLUMNS($B$8:C97)))","v":""},{"$f":"IF($Q93=\"\",\"\",INDEX(zawodniki,SMALL(IF(numerki=$Q93,ROW(numerki)-ROW(J$4)+1),COUNTIF($Q$4:$Q93,$Q93)),COLUMNS($B$8:D97)))","v":""},{"$f":"IF($Q93=\"\",\"\",INDEX(zawodniki,SMALL(IF(numerki=$Q93,ROW(numerki)-ROW(K$4)+1),COUNTIF($Q$4:$Q93,$Q93)),COLUMNS($B$8:E97)))","v":""},{"$f":"IF(ROWS($L$144:L233)>COUNT(numerki),\"\",SMALL(numerki,ROWS($L$144:L233)))","v":""}]
[67,1,"GRĘDA Jakub ",2006,"UKN LAWORTA Ustrzyki Dolne","Gr. 9",null,{"$f":"IF(G94=\"\",\"\",COUNTIF(G$4:G94,G94))","v":""},null,null,null,{"$f":"IF(Q94=\"\",\"\",SUBTOTAL(103,Q$4:Q94))","v":""},{"$f":"IF($Q94=\"\",\"\",INDEX(zawodniki,SMALL(IF(numerki=$Q94,ROW(numerki)-ROW(H$4)+1),COUNTIF($Q$4:$Q94,$Q94)),COLUMNS($B$8:B98)))","v":""},{"$f":"IF($Q94=\"\",\"\",INDEX(zawodniki,SMALL(IF(numerki=$Q94,ROW(numerki)-ROW(I$4)+1),COUNTIF($Q$4:$Q94,$Q94)),COLUMNS($B$8:C98)))","v":""},{"$f":"IF($Q94=\"\",\"\",INDEX(zawodniki,SMALL(IF(numerki=$Q94,ROW(numerki)-ROW(J$4)+1),COUNTIF($Q$4:$Q94,$Q94)),COLUMNS($B$8:D98)))","v":""},{"$f":"IF($Q94=\"\",\"\",INDEX(zawodniki,SMALL(IF(numerki=$Q94,ROW(numerki)-ROW(K$4)+1),COUNTIF($Q$4:$Q94,$Q94)),COLUMNS($B$8:E98)))","v":""},{"$f":"IF(ROWS($L$144:L234)>COUNT(numerki),\"\",SMALL(numerki,ROWS($L$144:L234)))","v":""}]
[68,2,"GAJDEK Filip ",2005,"UKN LAWORTA Ustrzyki Dolne","Gr. 9","x",{"$f":"IF(G95=\"\",\"\",COUNTIF(G$4:G95,G95))","v":4},null,null,null,{"$f":"IF(Q95=\"\",\"\",SUBTOTAL(103,Q$4:Q95))","v":""},{"$f":"IF($Q95=\"\",\"\",INDEX(zawodniki,SMALL(IF(numerki=$Q95,ROW(numerki)-ROW(H$4)+1),COUNTIF($Q$4:$Q95,$Q95)),COLUMNS($B$8:B99)))","v":""},{"$f":"IF($Q95=\"\",\"\",INDEX(zawodniki,SMALL(IF(numerki=$Q95,ROW(numerki)-ROW(I$4)+1),COUNTIF($Q$4:$Q95,$Q95)),COLUMNS($B$8:C99)))","v":""},{"$f":"IF($Q95=\"\",\"\",INDEX(zawodniki,SMALL(IF(numerki=$Q95,ROW(numerki)-ROW(J$4)+1),COUNTIF($Q$4:$Q95,$Q95)),COLUMNS($B$8:D99)))","v":""},{"$f":"IF($Q95=\"\",\"\",INDEX(zawodniki,SMALL(IF(numerki=$Q95,ROW(numerki)-ROW(K$4)+1),COUNTIF($Q$4:$Q95,$Q95)),COLUMNS($B$8:E99)))","v":""},{"$f":"IF(ROWS($L$144:L235)>COUNT(numerki),\"\",SMALL(numerki,ROWS($L$144:L235)))","v":""}]
[null,null,null,null,null,null,null,{"$f":"IF(G96=\"\",\"\",COUNTIF(G$4:G95,G96))","v":""},null,null,null,{"$f":"IF(Q96=\"\",\"\",SUBTOTAL(103,Q$4:Q96))","v":""},{"$f":"IF($Q96=\"\",\"\",INDEX(zawodniki,SMALL(IF(numerki=$Q96,ROW(numerki)-ROW(H$4)+1),COUNTIF($Q$4:$Q96,$Q96)),COLUMNS($B$8:B100)))","v":""},{"$f":"IF($Q96=\"\",\"\",INDEX(zawodniki,SMALL(IF(numerki=$Q96,ROW(numerki)-ROW(I$4)+1),COUNTIF($Q$4:$Q96,$Q96)),COLUMNS($B$8:C100)))","v":""},{"$f":"IF($Q96=\"\",\"\",INDEX(zawodniki,SMALL(IF(numerki=$Q96,ROW(numerki)-ROW(J$4)+1),COUNTIF($Q$4:$Q96,$Q96)),COLUMNS($B$8:D100)))","v":""},{"$f":"IF($Q96=\"\",\"\",INDEX(zawodniki,SMALL(IF(numerki=$Q96,ROW(numerki)-ROW(K$4)+1),COUNTIF($Q$4:$Q96,$Q96)),COLUMNS($B$8:E100)))","v":""},{"$f":"IF(ROWS($L$144:L236)>COUNT(numerki),\"\",SMALL(numerki,ROWS($L$144:L236)))","v":""}]
[null,null,null,null,null,null,null,{"$f":"IF(G97=\"\",\"\",COUNTIF(G$4:G95,G97))","v":""},null,null,null,{"$f":"IF(Q97=\"\",\"\",SUBTOTAL(103,Q$4:Q97))","v":""},{"$f":"IF($Q97=\"\",\"\",INDEX(zawodniki,SMALL(IF(numerki=$Q97,ROW(numerki)-ROW(H$4)+1),COUNTIF($Q$4:$Q97,$Q97)),COLUMNS($B$8:B101)))","v":""},{"$f":"IF($Q97=\"\",\"\",INDEX(zawodniki,SMALL(IF(numerki=$Q97,ROW(numerki)-ROW(I$4)+1),COUNTIF($Q$4:$Q97,$Q97)),COLUMNS($B$8:C101)))","v":""},{"$f":"IF($Q97=\"\",\"\",INDEX(zawodniki,SMALL(IF(numerki=$Q97,ROW(numerki)-ROW(J$4)+1),COUNTIF($Q$4:$Q97,$Q97)),COLUMNS($B$8:D101)))","v":""},{"$f":"IF($Q97=\"\",\"\",INDEX(zawodniki,SMALL(IF(numerki=$Q97,ROW(numerki)-ROW(K$4)+1),COUNTIF($Q$4:$Q97,$Q97)),COLUMNS($B$8:E101)))","v":""},{"$f":"IF(ROWS($L$144:L237)>COUNT(numerki),\"\",SMALL(numerki,ROWS($L$144:L237)))","v":""}]
[null,null,null,null,null,null,null,null,null,null,null,{"$f":"IF(Q98=\"\",\"\",SUBTOTAL(103,Q$4:Q98))","v":""},{"$f":"IF($Q98=\"\",\"\",INDEX(zawodniki,SMALL(IF(numerki=$Q98,ROW(numerki)-ROW(H$4)+1),COUNTIF($Q$4:$Q98,$Q98)),COLUMNS($B$8:B102)))","v":""},{"$f":"IF($Q98=\"\",\"\",INDEX(zawodniki,SMALL(IF(numerki=$Q98,ROW(numerki)-ROW(I$4)+1),COUNTIF($Q$4:$Q98,$Q98)),COLUMNS($B$8:C102)))","v":""},{"$f":"IF($Q98=\"\",\"\",INDEX(zawodniki,SMALL(IF(numerki=$Q98,ROW(numerki)-ROW(J$4)+1),COUNTIF($Q$4:$Q98,$Q98)),COLUMNS($B$8:D102)))","v":""},{"$f":"IF($Q98=\"\",\"\",INDEX(zawodniki,SMALL(IF(numerki=$Q98,ROW(numerki)-ROW(K$4)+1),COUNTIF($Q$4:$Q98,$Q98)),COLUMNS($B$8:E102)))","v":""},{"$f":"IF(ROWS($L$144:L238)>COUNT(numerki),\"\",SMALL(numerki,ROWS($L$144:L238)))","v":""}]
[null,null,null,null,null,null,null,null,null,null,null,{"$f":"IF(Q99=\"\",\"\",SUBTOTAL(103,Q$4:Q99))","v":""},{"$f":"IF($Q99=\"\",\"\",INDEX(zawodniki,SMALL(IF(numerki=$Q99,ROW(numerki)-ROW(H$4)+1),COUNTIF($Q$4:$Q99,$Q99)),COLUMNS($B$8:B103)))","v":""},{"$f":"IF($Q99=\"\",\"\",INDEX(zawodniki,SMALL(IF(numerki=$Q99,ROW(numerki)-ROW(I$4)+1),COUNTIF($Q$4:$Q99,$Q99)),COLUMNS($B$8:C103)))","v":""},{"$f":"IF($Q99=\"\",\"\",INDEX(zawodniki,SMALL(IF(numerki=$Q99,ROW(numerki)-ROW(J$4)+1),COUNTIF($Q$4:$Q99,$Q99)),COLUMNS($B$8:D103)))","v":""},{"$f":"IF($Q99=\"\",\"\",INDEX(zawodniki,SMALL(IF(numerki=$Q99,ROW(numerki)-ROW(K$4)+1),COUNTIF($Q$4:$Q99,$Q99)),COLUMNS($B$8:E103)))","v":""},{"$f":"IF(ROWS($L$144:L239)>COUNT(numerki),\"\",SMALL(numerki,ROWS($L$144:L239)))","v":""}]
[null,null,null,null,null,null,null,null,null,null,null,{"$f":"IF(Q100=\"\",\"\",SUBTOTAL(103,Q$4:Q100))","v":""},{"$f":"IF($Q100=\"\",\"\",INDEX(zawodniki,SMALL(IF(numerki=$Q100,ROW(numerki)-ROW(H$4)+1),COUNTIF($Q$4:$Q100,$Q100)),COLUMNS($B$8:B104)))","v":""},{"$f":"IF($Q100=\"\",\"\",INDEX(zawodniki,SMALL(IF(numerki=$Q100,ROW(numerki)-ROW(I$4)+1),COUNTIF($Q$4:$Q100,$Q100)),COLUMNS($B$8:C104)))","v":""},{"$f":"IF($Q100=\"\",\"\",INDEX(zawodniki,SMALL(IF(numerki=$Q100,ROW(numerki)-ROW(J$4)+1),COUNTIF($Q$4:$Q100,$Q100)),COLUMNS($B$8:D104)))","v":""},{"$f":"IF($Q100=\"\",\"\",INDEX(zawodniki,SMALL(IF(numerki=$Q100,ROW(numerki)-ROW(K$4)+1),COUNTIF($Q$4:$Q100,$Q100)),COLUMNS($B$8:E104)))","v":""},{"$f":"IF(ROWS($L$144:L240)>COUNT(numerki),\"\",SMALL(numerki,ROWS($L$144:L240)))","v":""}]
[null,null,null,null,null,null,null,null,null,null,null,{"$f":"IF(Q101=\"\",\"\",SUBTOTAL(103,Q$4:Q101))","v":""},{"$f":"IF($Q101=\"\",\"\",INDEX(zawodniki,SMALL(IF(numerki=$Q101,ROW(numerki)-ROW(H$4)+1),COUNTIF($Q$4:$Q101,$Q101)),COLUMNS($B$8:B105)))","v":""},{"$f":"IF($Q101=\"\",\"\",INDEX(zawodniki,SMALL(IF(numerki=$Q101,ROW(numerki)-ROW(I$4)+1),COUNTIF($Q$4:$Q101,$Q101)),COLUMNS($B$8:C105)))","v":""},{"$f":"IF($Q101=\"\",\"\",INDEX(zawodniki,SMALL(IF(numerki=$Q101,ROW(numerki)-ROW(J$4)+1),COUNTIF($Q$4:$Q101,$Q101)),COLUMNS($B$8:D105)))","v":""},{"$f":"IF($Q101=\"\",\"\",INDEX(zawodniki,SMALL(IF(numerki=$Q101,ROW(numerki)-ROW(K$4)+1),COUNTIF($Q$4:$Q101,$Q101)),COLUMNS($B$8:E105)))","v":""},{"$f":"IF(ROWS($L$144:L241)>COUNT(numerki),\"\",SMALL(numerki,ROWS($L$144:L241)))","v":""}]
[null,null,null,null,null,null,null,null,null,null,null,{"$f":"IF(Q102=\"\",\"\",SUBTOTAL(103,Q$4:Q102))","v":""},{"$f":"IF($Q102=\"\",\"\",INDEX(zawodniki,SMALL(IF(numerki=$Q102,ROW(numerki)-ROW(H$4)+1),COUNTIF($Q$4:$Q102,$Q102)),COLUMNS($B$8:B106)))","v":""},{"$f":"IF($Q102=\"\",\"\",INDEX(zawodniki,SMALL(IF(numerki=$Q102,ROW(numerki)-ROW(I$4)+1),COUNTIF($Q$4:$Q102,$Q102)),COLUMNS($B$8:C106)))","v":""},{"$f":"IF($Q102=\"\",\"\",INDEX(zawodniki,SMALL(IF(numerki=$Q102,ROW(numerki)-ROW(J$4)+1),COUNTIF($Q$4:$Q102,$Q102)),COLUMNS($B$8:D106)))","v":""},{"$f":"IF($Q102=\"\",\"\",INDEX(zawodniki,SMALL(IF(numerki=$Q102,ROW(numerki)-ROW(K$4)+1),COUNTIF($Q$4:$Q102,$Q102)),COLUMNS($B$8:E106)))","v":""},{"$f":"IF(ROWS($L$144:L242)>COUNT(numerki),\"\",SMALL(numerki,ROWS($L$144:L242)))","v":""}]
[null,null,null,null,null,null,null,null,null,null,null,{"$f":"IF(Q103=\"\",\"\",SUBTOTAL(103,Q$4:Q103))","v":""},{"$f":"IF($Q103=\"\",\"\",INDEX(zawodniki,SMALL(IF(numerki=$Q103,ROW(numerki)-ROW(H$4)+1),COUNTIF($Q$4:$Q103,$Q103)),COLUMNS($B$8:B107)))","v":""},{"$f":"IF($Q103=\"\",\"\",INDEX(zawodniki,SMALL(IF(numerki=$Q103,ROW(numerki)-ROW(I$4)+1),COUNTIF($Q$4:$Q103,$Q103)),COLUMNS($B$8:C107)))","v":""},{"$f":"IF($Q103=\"\",\"\",INDEX(zawodniki,SMALL(IF(numerki=$Q103,ROW(numerki)-ROW(J$4)+1),COUNTIF($Q$4:$Q103,$Q103)),COLUMNS($B$8:D107)))","v":""},{"$f":"IF($Q103=\"\",\"\",INDEX(zawodniki,SMALL(IF(numerki=$Q103,ROW(numerki)-ROW(K$4)+1),COUNTIF($Q$4:$Q103,$Q103)),COLUMNS($B$8:E107)))","v":""},{"$f":"IF(ROWS($L$144:L243)>COUNT(numerki),\"\",SMALL(numerki,ROWS($L$144:L243)))","v":""}]
[null,null,null,null,null,null,null,null,null,null,null,{"$f":"IF(Q104=\"\",\"\",SUBTOTAL(103,Q$4:Q104))","v":""},{"$f":"IF($Q104=\"\",\"\",INDEX(zawodniki,SMALL(IF(numerki=$Q104,ROW(numerki)-ROW(H$4)+1),COUNTIF($Q$4:$Q104,$Q104)),COLUMNS($B$8:B108)))","v":""},{"$f":"IF($Q104=\"\",\"\",INDEX(zawodniki,SMALL(IF(numerki=$Q104,ROW(numerki)-ROW(I$4)+1),COUNTIF($Q$4:$Q104,$Q104)),COLUMNS($B$8:C108)))","v":""},{"$f":"IF($Q104=\"\",\"\",INDEX(zawodniki,SMALL(IF(numerki=$Q104,ROW(numerki)-ROW(J$4)+1),COUNTIF($Q$4:$Q104,$Q104)),COLUMNS($B$8:D108)))","v":""},{"$f":"IF($Q104=\"\",\"\",INDEX(zawodniki,SMALL(IF(numerki=$Q104,ROW(numerki)-ROW(K$4)+1),COUNTIF($Q$4:$Q104,$Q104)),COLUMNS($B$8:E108)))","v":""},{"$f":"IF(ROWS($L$144:L244)>COUNT(numerki),\"\",SMALL(numerki,ROWS($L$144:L244)))","v":""}]
[null,null,null,null,null,null,null,null,null,null,null,{"$f":"IF(Q105=\"\",\"\",SUBTOTAL(103,Q$4:Q105))","v":""},{"$f":"IF($Q105=\"\",\"\",INDEX(zawodniki,SMALL(IF(numerki=$Q105,ROW(numerki)-ROW(H$4)+1),COUNTIF($Q$4:$Q105,$Q105)),COLUMNS($B$8:B109)))","v":""},{"$f":"IF($Q105=\"\",\"\",INDEX(zawodniki,SMALL(IF(numerki=$Q105,ROW(numerki)-ROW(I$4)+1),COUNTIF($Q$4:$Q105,$Q105)),COLUMNS($B$8:C109)))","v":""},{"$f":"IF($Q105=\"\",\"\",INDEX(zawodniki,SMALL(IF(numerki=$Q105,ROW(numerki)-ROW(J$4)+1),COUNTIF($Q$4:$Q105,$Q105)),COLUMNS($B$8:D109)))","v":""},{"$f":"IF($Q105=\"\",\"\",INDEX(zawodniki,SMALL(IF(numerki=$Q105,ROW(numerki)-ROW(K$4)+1),COUNTIF($Q$4:$Q105,$Q105)),COLUMNS($B$8:E109)))","v":""},{"$f":"IF(ROWS($L$144:L245)>COUNT(numerki),\"\",SMALL(numerki,ROWS($L$144:L245)))","v":""}]
[null,null,null,null,null,null,null,null,null,null,null,{"$f":"IF(Q106=\"\",\"\",SUBTOTAL(103,Q$4:Q106))","v":""},{"$f":"IF($Q106=\"\",\"\",INDEX(zawodniki,SMALL(IF(numerki=$Q106,ROW(numerki)-ROW(H$4)+1),COUNTIF($Q$4:$Q106,$Q106)),COLUMNS($B$8:B110)))","v":""},{"$f":"IF($Q106=\"\",\"\",INDEX(zawodniki,SMALL(IF(numerki=$Q106,ROW(numerki)-ROW(I$4)+1),COUNTIF($Q$4:$Q106,$Q106)),COLUMNS($B$8:C110)))","v":""},{"$f":"IF($Q106=\"\",\"\",INDEX(zawodniki,SMALL(IF(numerki=$Q106,ROW(numerki)-ROW(J$4)+1),COUNTIF($Q$4:$Q106,$Q106)),COLUMNS($B$8:D110)))","v":""},{"$f":"IF($Q106=\"\",\"\",INDEX(zawodniki,SMALL(IF(numerki=$Q106,ROW(numerki)-ROW(K$4)+1),COUNTIF($Q$4:$Q106,$Q106)),COLUMNS($B$8:E110)))","v":""},{"$f":"IF(ROWS($L$144:L246)>COUNT(numerki),\"\",SMALL(numerki,ROWS($L$144:L246)))","v":""}]
[null,null,null,null,null,null,null,null,null,null,null,{"$f":"IF(Q107=\"\",\"\",SUBTOTAL(103,Q$4:Q107))","v":""},{"$f":"IF($Q107=\"\",\"\",INDEX(zawodniki,SMALL(IF(numerki=$Q107,ROW(numerki)-ROW(H$4)+1),COUNTIF($Q$4:$Q107,$Q107)),COLUMNS($B$8:B111)))","v":""},{"$f":"IF($Q107=\"\",\"\",INDEX(zawodniki,SMALL(IF(numerki=$Q107,ROW(numerki)-ROW(I$4)+1),COUNTIF($Q$4:$Q107,$Q107)),COLUMNS($B$8:C111)))","v":""},{"$f":"IF($Q107=\"\",\"\",INDEX(zawodniki,SMALL(IF(numerki=$Q107,ROW(numerki)-ROW(J$4)+1),COUNTIF($Q$4:$Q107,$Q107)),COLUMNS($B$8:D111)))","v":""},{"$f":"IF($Q107=\"\",\"\",INDEX(zawodniki,SMALL(IF(numerki=$Q107,ROW(numerki)-ROW(K$4)+1),COUNTIF($Q$4:$Q107,$Q107)),COLUMNS($B$8:E111)))","v":""},{"$f":"IF(ROWS($L$144:L247)>COUNT(numerki),\"\",SMALL(numerki,ROWS($L$144:L247)))","v":""}]
[null,null,null,null,null,null,null,null,null,null,null,{"$f":"IF(Q108=\"\",\"\",SUBTOTAL(103,Q$4:Q108))","v":""},{"$f":"IF($Q108=\"\",\"\",INDEX(zawodniki,SMALL(IF(numerki=$Q108,ROW(numerki)-ROW(H$4)+1),COUNTIF($Q$4:$Q108,$Q108)),COLUMNS($B$8:B112)))","v":""},{"$f":"IF($Q108=\"\",\"\",INDEX(zawodniki,SMALL(IF(numerki=$Q108,ROW(numerki)-ROW(I$4)+1),COUNTIF($Q$4:$Q108,$Q108)),COLUMNS($B$8:C112)))","v":""},{"$f":"IF($Q108=\"\",\"\",INDEX(zawodniki,SMALL(IF(numerki=$Q108,ROW(numerki)-ROW(J$4)+1),COUNTIF($Q$4:$Q108,$Q108)),COLUMNS($B$8:D112)))","v":""},{"$f":"IF($Q108=\"\",\"\",INDEX(zawodniki,SMALL(IF(numerki=$Q108,ROW(numerki)-ROW(K$4)+1),COUNTIF($Q$4:$Q108,$Q108)),COLUMNS($B$8:E112)))","v":""},{"$f":"IF(ROWS($L$144:L248)>COUNT(numerki),\"\",SMALL(numerki,ROWS($L$144:L248)))","v":""}]
[null,null,null,null,null,null,null,null,null,null,null,{"$f":"IF(Q109=\"\",\"\",SUBTOTAL(103,Q$4:Q109))","v":""},{"$f":"IF($Q109=\"\",\"\",INDEX(zawodniki,SMALL(IF(numerki=$Q109,ROW(numerki)-ROW(H$4)+1),COUNTIF($Q$4:$Q109,$Q109)),COLUMNS($B$8:B113)))","v":""},{"$f":"IF($Q109=\"\",\"\",INDEX(zawodniki,SMALL(IF(numerki=$Q109,ROW(numerki)-ROW(I$4)+1),COUNTIF($Q$4:$Q109,$Q109)),COLUMNS($B$8:C113)))","v":""},{"$f":"IF($Q109=\"\",\"\",INDEX(zawodniki,SMALL(IF(numerki=$Q109,ROW(numerki)-ROW(J$4)+1),COUNTIF($Q$4:$Q109,$Q109)),COLUMNS($B$8:D113)))","v":""},{"$f":"IF($Q109=\"\",\"\",INDEX(zawodniki,SMALL(IF(numerki=$Q109,ROW(numerki)-ROW(K$4)+1),COUNTIF($Q$4:$Q109,$Q109)),COLUMNS($B$8:E113)))","v":""},{"$f":"IF(ROWS($L$144:L249)>COUNT(numerki),\"\",SMALL(numerki,ROWS($L$144:L249)))","v":""}]
[null,null,null,null,null,null,null,null,null,null,null,{"$f":"IF(Q110=\"\",\"\",SUBTOTAL(103,Q$4:Q110))","v":""},{"$f":"IF($Q110=\"\",\"\",INDEX(zawodniki,SMALL(IF(numerki=$Q110,ROW(numerki)-ROW(H$4)+1),COUNTIF($Q$4:$Q110,$Q110)),COLUMNS($B$8:B114)))","v":""},{"$f":"IF($Q110=\"\",\"\",INDEX(zawodniki,SMALL(IF(numerki=$Q110,ROW(numerki)-ROW(I$4)+1),COUNTIF($Q$4:$Q110,$Q110)),COLUMNS($B$8:C114)))","v":""},{"$f":"IF($Q110=\"\",\"\",INDEX(zawodniki,SMALL(IF(numerki=$Q110,ROW(numerki)-ROW(J$4)+1),COUNTIF($Q$4:$Q110,$Q110)),COLUMNS($B$8:D114)))","v":""},{"$f":"IF($Q110=\"\",\"\",INDEX(zawodniki,SMALL(IF(numerki=$Q110,ROW(numerki)-ROW(K$4)+1),COUNTIF($Q$4:$Q110,$Q110)),COLUMNS($B$8:E114)))","v":""},{"$f":"IF(ROWS($L$144:L250)>COUNT(numerki),\"\",SMALL(numerki,ROWS($L$144:L250)))","v":""}]
[null,null,null,null,null,null,null,null,null,null,null,{"$f":"IF(Q111=\"\",\"\",SUBTOTAL(103,Q$4:Q111))","v":""},{"$f":"IF($Q111=\"\",\"\",INDEX(zawodniki,SMALL(IF(numerki=$Q111,ROW(numerki)-ROW(H$4)+1),COUNTIF($Q$4:$Q111,$Q111)),COLUMNS($B$8:B115)))","v":""},{"$f":"IF($Q111=\"\",\"\",INDEX(zawodniki,SMALL(IF(numerki=$Q111,ROW(numerki)-ROW(I$4)+1),COUNTIF($Q$4:$Q111,$Q111)),COLUMNS($B$8:C115)))","v":""},{"$f":"IF($Q111=\"\",\"\",INDEX(zawodniki,SMALL(IF(numerki=$Q111,ROW(numerki)-ROW(J$4)+1),COUNTIF($Q$4:$Q111,$Q111)),COLUMNS($B$8:D115)))","v":""},{"$f":"IF($Q111=\"\",\"\",INDEX(zawodniki,SMALL(IF(numerki=$Q111,ROW(numerki)-ROW(K$4)+1),COUNTIF($Q$4:$Q111,$Q111)),COLUMNS($B$8:E115)))","v":""},{"$f":"IF(ROWS($L$144:L251)>COUNT(numerki),\"\",SMALL(numerki,ROWS($L$144:L251)))","v":""}]
[null,null,null,null,null,null,null,null,null,null,null,{"$f":"IF(Q112=\"\",\"\",SUBTOTAL(103,Q$4:Q112))","v":""},{"$f":"IF($Q112=\"\",\"\",INDEX(zawodniki,SMALL(IF(numerki=$Q112,ROW(numerki)-ROW(H$4)+1),COUNTIF($Q$4:$Q112,$Q112)),COLUMNS($B$8:B116)))","v":""},{"$f":"IF($Q112=\"\",\"\",INDEX(zawodniki,SMALL(IF(numerki=$Q112,ROW(numerki)-ROW(I$4)+1),COUNTIF($Q$4:$Q112,$Q112)),COLUMNS($B$8:C116)))","v":""},{"$f":"IF($Q112=\"\",\"\",INDEX(zawodniki,SMALL(IF(numerki=$Q112,ROW(numerki)-ROW(J$4)+1),COUNTIF($Q$4:$Q112,$Q112)),COLUMNS($B$8:D116)))","v":""},{"$f":"IF($Q112=\"\",\"\",INDEX(zawodniki,SMALL(IF(numerki=$Q112,ROW(numerki)-ROW(K$4)+1),COUNTIF($Q$4:$Q112,$Q112)),COLUMNS($B$8:E116)))","v":""},{"$f":"IF(ROWS($L$144:L252)>COUNT(numerki),\"\",SMALL(numerki,ROWS($L$144:L252)))","v":""}]
[null,null,null,null,null,null,null,null,null,null,null,{"$f":"IF(Q113=\"\",\"\",SUBTOTAL(103,Q$4:Q113))","v":""},{"$f":"IF($Q113=\"\",\"\",INDEX(zawodniki,SMALL(IF(numerki=$Q113,ROW(numerki)-ROW(H$4)+1),COUNTIF($Q$4:$Q113,$Q113)),COLUMNS($B$8:B117)))","v":""},{"$f":"IF($Q113=\"\",\"\",INDEX(zawodniki,SMALL(IF(numerki=$Q113,ROW(numerki)-ROW(I$4)+1),COUNTIF($Q$4:$Q113,$Q113)),COLUMNS($B$8:C117)))","v":""},{"$f":"IF($Q113=\"\",\"\",INDEX(zawodniki,SMALL(IF(numerki=$Q113,ROW(numerki)-ROW(J$4)+1),COUNTIF($Q$4:$Q113,$Q113)),COLUMNS($B$8:D117)))","v":""},{"$f":"IF($Q113=\"\",\"\",INDEX(zawodniki,SMALL(IF(numerki=$Q113,ROW(numerki)-ROW(K$4)+1),COUNTIF($Q$4:$Q113,$Q113)),COLUMNS($B$8:E117)))","v":""},{"$f":"IF(ROWS($L$144:L253)>COUNT(numerki),\"\",SMALL(numerki,ROWS($L$144:L253)))","v":""}]
[null,null,null,null,null,null,null,null,null,null,null,{"$f":"IF(Q114=\"\",\"\",SUBTOTAL(103,Q$4:Q114))","v":""},{"$f":"IF($Q114=\"\",\"\",INDEX(zawodniki,SMALL(IF(numerki=$Q114,ROW(numerki)-ROW(H$4)+1),COUNTIF($Q$4:$Q114,$Q114)),COLUMNS($B$8:B118)))","v":""},{"$f":"IF($Q114=\"\",\"\",INDEX(zawodniki,SMALL(IF(numerki=$Q114,ROW(numerki)-ROW(I$4)+1),COUNTIF($Q$4:$Q114,$Q114)),COLUMNS($B$8:C118)))","v":""},{"$f":"IF($Q114=\"\",\"\",INDEX(zawodniki,SMALL(IF(numerki=$Q114,ROW(numerki)-ROW(J$4)+1),COUNTIF($Q$4:$Q114,$Q114)),COLUMNS($B$8:D118)))","v":""},{"$f":"IF($Q114=\"\",\"\",INDEX(zawodniki,SMALL(IF(numerki=$Q114,ROW(numerki)-ROW(K$4)+1),COUNTIF($Q$4:$Q114,$Q114)),COLUMNS($B$8:E118)))","v":""},{"$f":"IF(ROWS($L$144:L254)>COUNT(numerki),\"\",SMALL(numerki,ROWS($L$144:L254)))","v":""}]
[null,null,null,null,null,null,null,null,null,null,null,{"$f":"IF(Q115=\"\",\"\",SUBTOTAL(103,Q$4:Q115))","v":""},{"$f":"IF($Q115=\"\",\"\",INDEX(zawodniki,SMALL(IF(numerki=$Q115,ROW(numerki)-ROW(H$4)+1),COUNTIF($Q$4:$Q115,$Q115)),COLUMNS($B$8:B119)))","v":""},{"$f":"IF($Q115=\"\",\"\",INDEX(zawodniki,SMALL(IF(numerki=$Q115,ROW(numerki)-ROW(I$4)+1),COUNTIF($Q$4:$Q115,$Q115)),COLUMNS($B$8:C119)))","v":""},{"$f":"IF($Q115=\"\",\"\",INDEX(zawodniki,SMALL(IF(numerki=$Q115,ROW(numerki)-ROW(J$4)+1),COUNTIF($Q$4:$Q115,$Q115)),COLUMNS($B$8:D119)))","v":""},{"$f":"IF($Q115=\"\",\"\",INDEX(zawodniki,SMALL(IF(numerki=$Q115,ROW(numerki)-ROW(K$4)+1),COUNTIF($Q$4:$Q115,$Q115)),COLUMNS($B$8:E119)))","v":""},{"$f":"IF(ROWS($L$144:L255)>COUNT(numerki),\"\",SMALL(numerki,ROWS($L$144:L255)))","v":""}]
[null,null,null,null,null,null,null,null,null,null,null,{"$f":"IF(Q116=\"\",\"\",SUBTOTAL(103,Q$4:Q116))","v":""},{"$f":"IF($Q116=\"\",\"\",INDEX(zawodniki,SMALL(IF(numerki=$Q116,ROW(numerki)-ROW(H$4)+1),COUNTIF($Q$4:$Q116,$Q116)),COLUMNS($B$8:B120)))","v":""},{"$f":"IF($Q116=\"\",\"\",INDEX(zawodniki,SMALL(IF(numerki=$Q116,ROW(numerki)-ROW(I$4)+1),COUNTIF($Q$4:$Q116,$Q116)),COLUMNS($B$8:C120)))","v":""},{"$f":"IF($Q116=\"\",\"\",INDEX(zawodniki,SMALL(IF(numerki=$Q116,ROW(numerki)-ROW(J$4)+1),COUNTIF($Q$4:$Q116,$Q116)),COLUMNS($B$8:D120)))","v":""},{"$f":"IF($Q116=\"\",\"\",INDEX(zawodniki,SMALL(IF(numerki=$Q116,ROW(numerki)-ROW(K$4)+1),COUNTIF($Q$4:$Q116,$Q116)),COLUMNS($B$8:E120)))","v":""},{"$f":"IF(ROWS($L$144:L256)>COUNT(numerki),\"\",SMALL(numerki,ROWS($L$144:L256)))","v":""}]
[null,null,null,null,null,null,null,null,null,null,null,{"$f":"IF(Q117=\"\",\"\",SUBTOTAL(103,Q$4:Q117))","v":""},{"$f":"IF($Q117=\"\",\"\",INDEX(zawodniki,SMALL(IF(numerki=$Q117,ROW(numerki)-ROW(H$4)+1),COUNTIF($Q$4:$Q117,$Q117)),COLUMNS($B$8:B121)))","v":""},{"$f":"IF($Q117=\"\",\"\",INDEX(zawodniki,SMALL(IF(numerki=$Q117,ROW(numerki)-ROW(I$4)+1),COUNTIF($Q$4:$Q117,$Q117)),COLUMNS($B$8:C121)))","v":""},{"$f":"IF($Q117=\"\",\"\",INDEX(zawodniki,SMALL(IF(numerki=$Q117,ROW(numerki)-ROW(J$4)+1),COUNTIF($Q$4:$Q117,$Q117)),COLUMNS($B$8:D121)))","v":""},{"$f":"IF($Q117=\"\",\"\",INDEX(zawodniki,SMALL(IF(numerki=$Q117,ROW(numerki)-ROW(K$4)+1),COUNTIF($Q$4:$Q117,$Q117)),COLUMNS($B$8:E121)))","v":""},{"$f":"IF(ROWS($L$144:L257)>COUNT(numerki),\"\",SMALL(numerki,ROWS($L$144:L257)))","v":""}]
[null,null,null,null,null,null,null,null,null,null,null,{"$f":"IF(Q118=\"\",\"\",SUBTOTAL(103,Q$4:Q118))","v":""},{"$f":"IF($Q118=\"\",\"\",INDEX(zawodniki,SMALL(IF(numerki=$Q118,ROW(numerki)-ROW(H$4)+1),COUNTIF($Q$4:$Q118,$Q118)),COLUMNS($B$8:B122)))","v":""},{"$f":"IF($Q118=\"\",\"\",INDEX(zawodniki,SMALL(IF(numerki=$Q118,ROW(numerki)-ROW(I$4)+1),COUNTIF($Q$4:$Q118,$Q118)),COLUMNS($B$8:C122)))","v":""},{"$f":"IF($Q118=\"\",\"\",INDEX(zawodniki,SMALL(IF(numerki=$Q118,ROW(numerki)-ROW(J$4)+1),COUNTIF($Q$4:$Q118,$Q118)),COLUMNS($B$8:D122)))","v":""},{"$f":"IF($Q118=\"\",\"\",INDEX(zawodniki,SMALL(IF(numerki=$Q118,ROW(numerki)-ROW(K$4)+1),COUNTIF($Q$4:$Q118,$Q118)),COLUMNS($B$8:E122)))","v":""},{"$f":"IF(ROWS($L$144:L258)>COUNT(numerki),\"\",SMALL(numerki,ROWS($L$144:L258)))","v":""}]
[null,null,null,null,null,null,null,null,null,null,null,{"$f":"IF(Q119=\"\",\"\",SUBTOTAL(103,Q$4:Q119))","v":""},{"$f":"IF($Q119=\"\",\"\",INDEX(zawodniki,SMALL(IF(numerki=$Q119,ROW(numerki)-ROW(H$4)+1),COUNTIF($Q$4:$Q119,$Q119)),COLUMNS($B$8:B123)))","v":""},{"$f":"IF($Q119=\"\",\"\",INDEX(zawodniki,SMALL(IF(numerki=$Q119,ROW(numerki)-ROW(I$4)+1),COUNTIF($Q$4:$Q119,$Q119)),COLUMNS($B$8:C123)))","v":""},{"$f":"IF($Q119=\"\",\"\",INDEX(zawodniki,SMALL(IF(numerki=$Q119,ROW(numerki)-ROW(J$4)+1),COUNTIF($Q$4:$Q119,$Q119)),COLUMNS($B$8:D123)))","v":""},{"$f":"IF($Q119=\"\",\"\",INDEX(zawodniki,SMALL(IF(numerki=$Q119,ROW(numerki)-ROW(K$4)+1),COUNTIF($Q$4:$Q119,$Q119)),COLUMNS($B$8:E123)))","v":""},{"$f":"IF(ROWS($L$144:L259)>COUNT(numerki),\"\",SMALL(numerki,ROWS($L$144:L259)))","v":""}]
[null,null,null,null,null,null,null,null,null,null,null,{"$f":"IF(Q120=\"\",\"\",SUBTOTAL(103,Q$4:Q120))","v":""},{"$f":"IF($Q120=\"\",\"\",INDEX(zawodniki,SMALL(IF(numerki=$Q120,ROW(numerki)-ROW(H$4)+1),COUNTIF($Q$4:$Q120,$Q120)),COLUMNS($B$8:B124)))","v":""},{"$f":"IF($Q120=\"\",\"\",INDEX(zawodniki,SMALL(IF(numerki=$Q120,ROW(numerki)-ROW(I$4)+1),COUNTIF($Q$4:$Q120,$Q120)),COLUMNS($B$8:C124)))","v":""},{"$f":"IF($Q120=\"\",\"\",INDEX(zawodniki,SMALL(IF(numerki=$Q120,ROW(numerki)-ROW(J$4)+1),COUNTIF($Q$4:$Q120,$Q120)),COLUMNS($B$8:D124)))","v":""},{"$f":"IF($Q120=\"\",\"\",INDEX(zawodniki,SMALL(IF(numerki=$Q120,ROW(numerki)-ROW(K$4)+1),COUNTIF($Q$4:$Q120,$Q120)),COLUMNS($B$8:E124)))","v":""},{"$f":"IF(ROWS($L$144:L260)>COUNT(numerki),\"\",SMALL(numerki,ROWS($L$144:L260)))","v":""}]
[]
[]
[]
[]
[]
[]
[]
[]
[]
[]
[]
[]
[]
[]
[]
[]
[]
[]
[]
[]
[]
[]
[]
[]
[]
[]
[]
[]
[]
[]
[]
[]
[]
[]
[]
[]
[]
[]
[]
[]
[]
[]
[]
[]
[]
[]
[]
[]
[]
[]
[]
[]
[]
[]
[]
[]
[]
[]
[]
[]
[]
[]
[]
[]
[]
[]
[]
[]
[]
[]
[]
[]
[]
[]
[]
[]
[]
[]
[]
[]
[]
[]
[]
[]
[]
[]
[]
[]
[]
[]
[]
[]
[]
[]
[]
[]
[]
[]
[]
[]
[]
[]
[]
[]
[]
[]
[]
[]
[]
[]
[]
[]
[]
[]
[]
[]
[]
[]
[null,null,null,null,null,null,null,null,null,null,null,{"$f":"IF(Q239=\"\",\"\",SUBTOTAL(103,Q$4:Q239))","v":""},{"$f":"IF($Q239=\"\",\"\",INDEX(zawodniki,SMALL(IF(numerki=$Q239,ROW(numerki)-ROW(H$4)+1),COUNTIF($Q$4:$Q239,$Q239)),COLUMNS($B$8:B121)))","v":""},{"$f":"IF($Q239=\"\",\"\",INDEX(zawodniki,SMALL(IF(numerki=$Q239,ROW(numerki)-ROW(I$4)+1),COUNTIF($Q$4:$Q239,$Q239)),COLUMNS($B$8:C121)))","v":""},{"$f":"IF($Q239=\"\",\"\",INDEX(zawodniki,SMALL(IF(numerki=$Q239,ROW(numerki)-ROW(J$4)+1),COUNTIF($Q$4:$Q239,$Q239)),COLUMNS($B$8:D121)))","v":""},{"$f":"IF($Q239=\"\",\"\",INDEX(zawodniki,SMALL(IF(numerki=$Q239,ROW(numerki)-ROW(K$4)+1),COUNTIF($Q$4:$Q239,$Q239)),COLUMNS($B$8:E121)))","v":""},{"$f":"IF(ROWS($L$144:L257)>COUNT(numerki),\"\",SMALL(numerki,ROWS($L$144:L257)))","v":""}]
[null,null,null,null,null,null,null,null,null,null,null,{"$f":"IF(Q240=\"\",\"\",SUBTOTAL(103,Q$4:Q240))","v":""},{"$f":"IF($Q240=\"\",\"\",INDEX(zawodniki,SMALL(IF(numerki=$Q240,ROW(numerki)-ROW(H$4)+1),COUNTIF($Q$4:$Q240,$Q240)),COLUMNS($B$8:B122)))","v":""},{"$f":"IF($Q240=\"\",\"\",INDEX(zawodniki,SMALL(IF(numerki=$Q240,ROW(numerki)-ROW(I$4)+1),COUNTIF($Q$4:$Q240,$Q240)),COLUMNS($B$8:C122)))","v":""},{"$f":"IF($Q240=\"\",\"\",INDEX(zawodniki,SMALL(IF(numerki=$Q240,ROW(numerki)-ROW(J$4)+1),COUNTIF($Q$4:$Q240,$Q240)),COLUMNS($B$8:D122)))","v":""},{"$f":"IF($Q240=\"\",\"\",INDEX(zawodniki,SMALL(IF(numerki=$Q240,ROW(numerki)-ROW(K$4)+1),COUNTIF($Q$4:$Q240,$Q240)),COLUMNS($B$8:E122)))","v":""},{"$f":"IF(ROWS($L$144:L258)>COUNT(numerki),\"\",SMALL(numerki,ROWS($L$144:L258)))","v":""}]
[null,null,null,null,null,null,null,null,null,null,null,{"$f":"IF(Q241=\"\",\"\",SUBTOTAL(103,Q$4:Q241))","v":""},{"$f":"IF($Q241=\"\",\"\",INDEX(zawodniki,SMALL(IF(numerki=$Q241,ROW(numerki)-ROW(H$4)+1),COUNTIF($Q$4:$Q241,$Q241)),COLUMNS($B$8:B123)))","v":""},{"$f":"IF($Q241=\"\",\"\",INDEX(zawodniki,SMALL(IF(numerki=$Q241,ROW(numerki)-ROW(I$4)+1),COUNTIF($Q$4:$Q241,$Q241)),COLUMNS($B$8:C123)))","v":""},{"$f":"IF($Q241=\"\",\"\",INDEX(zawodniki,SMALL(IF(numerki=$Q241,ROW(numerki)-ROW(J$4)+1),COUNTIF($Q$4:$Q241,$Q241)),COLUMNS($B$8:D123)))","v":""},{"$f":"IF($Q241=\"\",\"\",INDEX(zawodniki,SMALL(IF(numerki=$Q241,ROW(numerki)-ROW(K$4)+1),COUNTIF($Q$4:$Q241,$Q241)),COLUMNS($B$8:E123)))","v":""},{"$f":"IF(ROWS($L$144:L259)>COUNT(numerki),\"\",SMALL(numerki,ROWS($L$144:L259)))","v":""}]
[null,null,null,null,null,null,null,null,null,null,null,{"$f":"IF(Q242=\"\",\"\",SUBTOTAL(103,Q$4:Q242))","v":""},{"$f":"IF($Q242=\"\",\"\",INDEX(zawodniki,SMALL(IF(numerki=$Q242,ROW(numerki)-ROW(H$4)+1),COUNTIF($Q$4:$Q242,$Q242)),COLUMNS($B$8:B124)))","v":""},{"$f":"IF($Q242=\"\",\"\",INDEX(zawodniki,SMALL(IF(numerki=$Q242,ROW(numerki)-ROW(I$4)+1),COUNTIF($Q$4:$Q242,$Q242)),COLUMNS($B$8:C124)))","v":""},{"$f":"IF($Q242=\"\",\"\",INDEX(zawodniki,SMALL(IF(numerki=$Q242,ROW(numerki)-ROW(J$4)+1),COUNTIF($Q$4:$Q242,$Q242)),COLUMNS($B$8:D124)))","v":""},{"$f":"IF($Q242=\"\",\"\",INDEX(zawodniki,SMALL(IF(numerki=$Q242,ROW(numerki)-ROW(K$4)+1),COUNTIF($Q$4:$Q242,$Q242)),COLUMNS($B$8:E124)))","v":""},{"$f":"IF(ROWS($L$144:L260)>COUNT(numerki),\"\",SMALL(numerki,ROWS($L$144:L260)))","v":""}]
[null,null,null,null,null,null,null,null,null,null,null,{"$f":"IF(Q243=\"\",\"\",SUBTOTAL(103,Q$4:Q243))","v":""},{"$f":"IF($Q243=\"\",\"\",INDEX(zawodniki,SMALL(IF(numerki=$Q243,ROW(numerki)-ROW(H$4)+1),COUNTIF($Q$4:$Q243,$Q243)),COLUMNS($B$8:B125)))","v":""},{"$f":"IF($Q243=\"\",\"\",INDEX(zawodniki,SMALL(IF(numerki=$Q243,ROW(numerki)-ROW(I$4)+1),COUNTIF($Q$4:$Q243,$Q243)),COLUMNS($B$8:C125)))","v":""},{"$f":"IF($Q243=\"\",\"\",INDEX(zawodniki,SMALL(IF(numerki=$Q243,ROW(numerki)-ROW(J$4)+1),COUNTIF($Q$4:$Q243,$Q243)),COLUMNS($B$8:D125)))","v":""},{"$f":"IF($Q243=\"\",\"\",INDEX(zawodniki,SMALL(IF(numerki=$Q243,ROW(numerki)-ROW(K$4)+1),COUNTIF($Q$4:$Q243,$Q243)),COLUMNS($B$8:E125)))","v":""},{"$f":"IF(ROWS($L$144:L261)>COUNT(numerki),\"\",SMALL(numerki,ROWS($L$144:L261)))","v":""}]
[null,null,null,null,null,null,null,null,null,null,null,{"$f":"IF(Q244=\"\",\"\",SUBTOTAL(103,Q$4:Q244))","v":""},{"$f":"IF($Q244=\"\",\"\",INDEX(zawodniki,SMALL(IF(numerki=$Q244,ROW(numerki)-ROW(H$4)+1),COUNTIF($Q$4:$Q244,$Q244)),COLUMNS($B$8:B126)))","v":""},{"$f":"IF($Q244=\"\",\"\",INDEX(zawodniki,SMALL(IF(numerki=$Q244,ROW(numerki)-ROW(I$4)+1),COUNTIF($Q$4:$Q244,$Q244)),COLUMNS($B$8:C126)))","v":""},{"$f":"IF($Q244=\"\",\"\",INDEX(zawodniki,SMALL(IF(numerki=$Q244,ROW(numerki)-ROW(J$4)+1),COUNTIF($Q$4:$Q244,$Q244)),COLUMNS($B$8:D126)))","v":""},{"$f":"IF($Q244=\"\",\"\",INDEX(zawodniki,SMALL(IF(numerki=$Q244,ROW(numerki)-ROW(K$4)+1),COUNTIF($Q$4:$Q244,$Q244)),COLUMNS($B$8:E126)))","v":""},{"$f":"IF(ROWS($L$144:L262)>COUNT(numerki),\"\",SMALL(numerki,ROWS($L$144:L262)))","v":""}]
[null,null,null,null,null,null,null,null,null,null,null,{"$f":"IF(Q245=\"\",\"\",SUBTOTAL(103,Q$4:Q245))","v":""},{"$f":"IF($Q245=\"\",\"\",INDEX(zawodniki,SMALL(IF(numerki=$Q245,ROW(numerki)-ROW(H$4)+1),COUNTIF($Q$4:$Q245,$Q245)),COLUMNS($B$8:B127)))","v":""},{"$f":"IF($Q245=\"\",\"\",INDEX(zawodniki,SMALL(IF(numerki=$Q245,ROW(numerki)-ROW(I$4)+1),COUNTIF($Q$4:$Q245,$Q245)),COLUMNS($B$8:C127)))","v":""},{"$f":"IF($Q245=\"\",\"\",INDEX(zawodniki,SMALL(IF(numerki=$Q245,ROW(numerki)-ROW(J$4)+1),COUNTIF($Q$4:$Q245,$Q245)),COLUMNS($B$8:D127)))","v":""},{"$f":"IF($Q245=\"\",\"\",INDEX(zawodniki,SMALL(IF(numerki=$Q245,ROW(numerki)-ROW(K$4)+1),COUNTIF($Q$4:$Q245,$Q245)),COLUMNS($B$8:E127)))","v":""},{"$f":"IF(ROWS($L$144:L263)>COUNT(numerki),\"\",SMALL(numerki,ROWS($L$144:L263)))","v":""}]
[null,null,null,null,null,null,null,null,null,null,null,{"$f":"IF(Q246=\"\",\"\",SUBTOTAL(103,Q$4:Q246))","v":""},{"$f":"IF($Q246=\"\",\"\",INDEX(zawodniki,SMALL(IF(numerki=$Q246,ROW(numerki)-ROW(H$4)+1),COUNTIF($Q$4:$Q246,$Q246)),COLUMNS($B$8:B128)))","v":""},{"$f":"IF($Q246=\"\",\"\",INDEX(zawodniki,SMALL(IF(numerki=$Q246,ROW(numerki)-ROW(I$4)+1),COUNTIF($Q$4:$Q246,$Q246)),COLUMNS($B$8:C128)))","v":""},{"$f":"IF($Q246=\"\",\"\",INDEX(zawodniki,SMALL(IF(numerki=$Q246,ROW(numerki)-ROW(J$4)+1),COUNTIF($Q$4:$Q246,$Q246)),COLUMNS($B$8:D128)))","v":""},{"$f":"IF($Q246=\"\",\"\",INDEX(zawodniki,SMALL(IF(numerki=$Q246,ROW(numerki)-ROW(K$4)+1),COUNTIF($Q$4:$Q246,$Q246)),COLUMNS($B$8:E128)))","v":""},{"$f":"IF(ROWS($L$144:L264)>COUNT(numerki),\"\",SMALL(numerki,ROWS($L$144:L264)))","v":""}]
[null,null,null,null,null,null,null,null,null,null,null,{"$f":"IF(Q247=\"\",\"\",SUBTOTAL(103,Q$4:Q247))","v":""},{"$f":"IF($Q247=\"\",\"\",INDEX(zawodniki,SMALL(IF(numerki=$Q247,ROW(numerki)-ROW(H$4)+1),COUNTIF($Q$4:$Q247,$Q247)),COLUMNS($B$8:B129)))","v":""},{"$f":"IF($Q247=\"\",\"\",INDEX(zawodniki,SMALL(IF(numerki=$Q247,ROW(numerki)-ROW(I$4)+1),COUNTIF($Q$4:$Q247,$Q247)),COLUMNS($B$8:C129)))","v":""},{"$f":"IF($Q247=\"\",\"\",INDEX(zawodniki,SMALL(IF(numerki=$Q247,ROW(numerki)-ROW(J$4)+1),COUNTIF($Q$4:$Q247,$Q247)),COLUMNS($B$8:D129)))","v":""},{"$f":"IF($Q247=\"\",\"\",INDEX(zawodniki,SMALL(IF(numerki=$Q247,ROW(numerki)-ROW(K$4)+1),COUNTIF($Q$4:$Q247,$Q247)),COLUMNS($B$8:E129)))","v":""},{"$f":"IF(ROWS($L$144:L265)>COUNT(numerki),\"\",SMALL(numerki,ROWS($L$144:L265)))","v":""}]
[null,null,null,null,null,null,null,null,null,null,null,{"$f":"IF(Q248=\"\",\"\",SUBTOTAL(103,Q$4:Q248))","v":""},{"$f":"IF($Q248=\"\",\"\",INDEX(zawodniki,SMALL(IF(numerki=$Q248,ROW(numerki)-ROW(H$4)+1),COUNTIF($Q$4:$Q248,$Q248)),COLUMNS($B$8:B130)))","v":""},{"$f":"IF($Q248=\"\",\"\",INDEX(zawodniki,SMALL(IF(numerki=$Q248,ROW(numerki)-ROW(I$4)+1),COUNTIF($Q$4:$Q248,$Q248)),COLUMNS($B$8:C130)))","v":""},{"$f":"IF($Q248=\"\",\"\",INDEX(zawodniki,SMALL(IF(numerki=$Q248,ROW(numerki)-ROW(J$4)+1),COUNTIF($Q$4:$Q248,$Q248)),COLUMNS($B$8:D130)))","v":""},{"$f":"IF($Q248=\"\",\"\",INDEX(zawodniki,SMALL(IF(numerki=$Q248,ROW(numerki)-ROW(K$4)+1),COUNTIF($Q$4:$Q248,$Q248)),COLUMNS($B$8:E130)))","v":""},{"$f":"IF(ROWS($L$144:L266)>COUNT(numerki),\"\",SMALL(numerki,ROWS($L$144:L266)))","v":""}]
[null,null,null,null,null,null,null,null,null,null,null,{"$f":"IF(Q249=\"\",\"\",SUBTOTAL(103,Q$4:Q249))","v":""},{"$f":"IF($Q249=\"\",\"\",INDEX(zawodniki,SMALL(IF(numerki=$Q249,ROW(numerki)-ROW(H$4)+1),COUNTIF($Q$4:$Q249,$Q249)),COLUMNS($B$8:B131)))","v":""},{"$f":"IF($Q249=\"\",\"\",INDEX(zawodniki,SMALL(IF(numerki=$Q249,ROW(numerki)-ROW(I$4)+1),COUNTIF($Q$4:$Q249,$Q249)),COLUMNS($B$8:C131)))","v":""},{"$f":"IF($Q249=\"\",\"\",INDEX(zawodniki,SMALL(IF(numerki=$Q249,ROW(numerki)-ROW(J$4)+1),COUNTIF($Q$4:$Q249,$Q249)),COLUMNS($B$8:D131)))","v":""},{"$f":"IF($Q249=\"\",\"\",INDEX(zawodniki,SMALL(IF(numerki=$Q249,ROW(numerki)-ROW(K$4)+1),COUNTIF($Q$4:$Q249,$Q249)),COLUMNS($B$8:E131)))","v":""},{"$f":"IF(ROWS($L$144:L267)>COUNT(numerki),\"\",SMALL(numerki,ROWS($L$144:L267)))","v":""}]
[null,null,null,null,null,null,null,null,null,null,null,{"$f":"IF(Q250=\"\",\"\",SUBTOTAL(103,Q$4:Q250))","v":""},{"$f":"IF($Q250=\"\",\"\",INDEX(zawodniki,SMALL(IF(numerki=$Q250,ROW(numerki)-ROW(H$4)+1),COUNTIF($Q$4:$Q250,$Q250)),COLUMNS($B$8:B132)))","v":""},{"$f":"IF($Q250=\"\",\"\",INDEX(zawodniki,SMALL(IF(numerki=$Q250,ROW(numerki)-ROW(I$4)+1),COUNTIF($Q$4:$Q250,$Q250)),COLUMNS($B$8:C132)))","v":""},{"$f":"IF($Q250=\"\",\"\",INDEX(zawodniki,SMALL(IF(numerki=$Q250,ROW(numerki)-ROW(J$4)+1),COUNTIF($Q$4:$Q250,$Q250)),COLUMNS($B$8:D132)))","v":""},{"$f":"IF($Q250=\"\",\"\",INDEX(zawodniki,SMALL(IF(numerki=$Q250,ROW(numerki)-ROW(K$4)+1),COUNTIF($Q$4:$Q250,$Q250)),COLUMNS($B$8:E132)))","v":""},{"$f":"IF(ROWS($L$144:L268)>COUNT(numerki),\"\",SMALL(numerki,ROWS($L$144:L268)))","v":""}]
[null,null,null,null,null,null,null,null,null,null,null,{"$f":"IF(Q251=\"\",\"\",SUBTOTAL(103,Q$4:Q251))","v":""},{"$f":"IF($Q251=\"\",\"\",INDEX(zawodniki,SMALL(IF(numerki=$Q251,ROW(numerki)-ROW(H$4)+1),COUNTIF($Q$4:$Q251,$Q251)),COLUMNS($B$8:B133)))","v":""},{"$f":"IF($Q251=\"\",\"\",INDEX(zawodniki,SMALL(IF(numerki=$Q251,ROW(numerki)-ROW(I$4)+1),COUNTIF($Q$4:$Q251,$Q251)),COLUMNS($B$8:C133)))","v":""},{"$f":"IF($Q251=\"\",\"\",INDEX(zawodniki,SMALL(IF(numerki=$Q251,ROW(numerki)-ROW(J$4)+1),COUNTIF($Q$4:$Q251,$Q251)),COLUMNS($B$8:D133)))","v":""},{"$f":"IF($Q251=\"\",\"\",INDEX(zawodniki,SMALL(IF(numerki=$Q251,ROW(numerki)-ROW(K$4)+1),COUNTIF($Q$4:$Q251,$Q251)),COLUMNS($B$8:E133)))","v":""},{"$f":"IF(ROWS($L$144:L269)>COUNT(numerki),\"\",SMALL(numerki,ROWS($L$144:L269)))","v":""}]
[null,null,null,null,null,null,null,null,null,null,null,{"$f":"IF(Q252=\"\",\"\",SUBTOTAL(103,Q$4:Q252))","v":""},{"$f":"IF($Q252=\"\",\"\",INDEX(zawodniki,SMALL(IF(numerki=$Q252,ROW(numerki)-ROW(H$4)+1),COUNTIF($Q$4:$Q252,$Q252)),COLUMNS($B$8:B134)))","v":""},{"$f":"IF($Q252=\"\",\"\",INDEX(zawodniki,SMALL(IF(numerki=$Q252,ROW(numerki)-ROW(I$4)+1),COUNTIF($Q$4:$Q252,$Q252)),COLUMNS($B$8:C134)))","v":""},{"$f":"IF($Q252=\"\",\"\",INDEX(zawodniki,SMALL(IF(numerki=$Q252,ROW(numerki)-ROW(J$4)+1),COUNTIF($Q$4:$Q252,$Q252)),COLUMNS($B$8:D134)))","v":""},{"$f":"IF($Q252=\"\",\"\",INDEX(zawodniki,SMALL(IF(numerki=$Q252,ROW(numerki)-ROW(K$4)+1),COUNTIF($Q$4:$Q252,$Q252)),COLUMNS($B$8:E134)))","v":""},{"$f":"IF(ROWS($L$144:L270)>COUNT(numerki),\"\",SMALL(numerki,ROWS($L$144:L270)))","v":""}]
[null,null,null,null,null,null,null,null,null,null,null,{"$f":"IF(Q253=\"\",\"\",SUBTOTAL(103,Q$4:Q253))","v":""},{"$f":"IF($Q253=\"\",\"\",INDEX(zawodniki,SMALL(IF(numerki=$Q253,ROW(numerki)-ROW(H$4)+1),COUNTIF($Q$4:$Q253,$Q253)),COLUMNS($B$8:B135)))","v":""},{"$f":"IF($Q253=\"\",\"\",INDEX(zawodniki,SMALL(IF(numerki=$Q253,ROW(numerki)-ROW(I$4)+1),COUNTIF($Q$4:$Q253,$Q253)),COLUMNS($B$8:C135)))","v":""},{"$f":"IF($Q253=\"\",\"\",INDEX(zawodniki,SMALL(IF(numerki=$Q253,ROW(numerki)-ROW(J$4)+1),COUNTIF($Q$4:$Q253,$Q253)),COLUMNS($B$8:D135)))","v":""},{"$f":"IF($Q253=\"\",\"\",INDEX(zawodniki,SMALL(IF(numerki=$Q253,ROW(numerki)-ROW(K$4)+1),COUNTIF($Q$4:$Q253,$Q253)),COLUMNS($B$8:E135)))","v":""},{"$f":"IF(ROWS($L$144:L271)>COUNT(numerki),\"\",SMALL(numerki,ROWS($L$144:L271)))","v":""}]
[null,null,null,null,null,null,null,null,null,null,null,{"$f":"IF(Q254=\"\",\"\",SUBTOTAL(103,Q$4:Q254))","v":""},{"$f":"IF($Q254=\"\",\"\",INDEX(zawodniki,SMALL(IF(numerki=$Q254,ROW(numerki)-ROW(H$4)+1),COUNTIF($Q$4:$Q254,$Q254)),COLUMNS($B$8:B136)))","v":""},{"$f":"IF($Q254=\"\",\"\",INDEX(zawodniki,SMALL(IF(numerki=$Q254,ROW(numerki)-ROW(I$4)+1),COUNTIF($Q$4:$Q254,$Q254)),COLUMNS($B$8:C136)))","v":""},{"$f":"IF($Q254=\"\",\"\",INDEX(zawodniki,SMALL(IF(numerki=$Q254,ROW(numerki)-ROW(J$4)+1),COUNTIF($Q$4:$Q254,$Q254)),COLUMNS($B$8:D136)))","v":""},{"$f":"IF($Q254=\"\",\"\",INDEX(zawodniki,SMALL(IF(numerki=$Q254,ROW(numerki)-ROW(K$4)+1),COUNTIF($Q$4:$Q254,$Q254)),COLUMNS($B$8:E136)))","v":""},{"$f":"IF(ROWS($L$144:L272)>COUNT(numerki),\"\",SMALL(numerki,ROWS($L$144:L272)))","v":""}]
[null,null,null,null,null,null,null,null,null,null,null,{"$f":"IF(Q255=\"\",\"\",SUBTOTAL(103,Q$4:Q255))","v":""},{"$f":"IF($Q255=\"\",\"\",INDEX(zawodniki,SMALL(IF(numerki=$Q255,ROW(numerki)-ROW(H$4)+1),COUNTIF($Q$4:$Q255,$Q255)),COLUMNS($B$8:B137)))","v":""},{"$f":"IF($Q255=\"\",\"\",INDEX(zawodniki,SMALL(IF(numerki=$Q255,ROW(numerki)-ROW(I$4)+1),COUNTIF($Q$4:$Q255,$Q255)),COLUMNS($B$8:C137)))","v":""},{"$f":"IF($Q255=\"\",\"\",INDEX(zawodniki,SMALL(IF(numerki=$Q255,ROW(numerki)-ROW(J$4)+1),COUNTIF($Q$4:$Q255,$Q255)),COLUMNS($B$8:D137)))","v":""},{"$f":"IF($Q255=\"\",\"\",INDEX(zawodniki,SMALL(IF(numerki=$Q255,ROW(numerki)-ROW(K$4)+1),COUNTIF($Q$4:$Q255,$Q255)),COLUMNS($B$8:E137)))","v":""},{"$f":"IF(ROWS($L$144:L273)>COUNT(numerki),\"\",SMALL(numerki,ROWS($L$144:L273)))","v":""}]
[null,null,null,null,null,null,null,null,null,null,null,{"$f":"IF(Q256=\"\",\"\",SUBTOTAL(103,Q$4:Q256))","v":""},{"$f":"IF($Q256=\"\",\"\",INDEX(zawodniki,SMALL(IF(numerki=$Q256,ROW(numerki)-ROW(H$4)+1),COUNTIF($Q$4:$Q256,$Q256)),COLUMNS($B$8:B138)))","v":""},{"$f":"IF($Q256=\"\",\"\",INDEX(zawodniki,SMALL(IF(numerki=$Q256,ROW(numerki)-ROW(I$4)+1),COUNTIF($Q$4:$Q256,$Q256)),COLUMNS($B$8:C138)))","v":""},{"$f":"IF($Q256=\"\",\"\",INDEX(zawodniki,SMALL(IF(numerki=$Q256,ROW(numerki)-ROW(J$4)+1),COUNTIF($Q$4:$Q256,$Q256)),COLUMNS($B$8:D138)))","v":""},{"$f":"IF($Q256=\"\",\"\",INDEX(zawodniki,SMALL(IF(numerki=$Q256,ROW(numerki)-ROW(K$4)+1),COUNTIF($Q$4:$Q256,$Q256)),COLUMNS($B$8:E138)))","v":""},{"$f":"IF(ROWS($L$144:L274)>COUNT(numerki),\"\",SMALL(numerki,ROWS($L$144:L274)))","v":""}]
[null,null,null,null,null,null,null,null,null,null,null,{"$f":"IF(Q257=\"\",\"\",SUBTOTAL(103,Q$4:Q257))","v":""},{"$f":"IF($Q257=\"\",\"\",INDEX(zawodniki,SMALL(IF(numerki=$Q257,ROW(numerki)-ROW(H$4)+1),COUNTIF($Q$4:$Q257,$Q257)),COLUMNS($B$8:B139)))","v":""},{"$f":"IF($Q257=\"\",\"\",INDEX(zawodniki,SMALL(IF(numerki=$Q257,ROW(numerki)-ROW(I$4)+1),COUNTIF($Q$4:$Q257,$Q257)),COLUMNS($B$8:C139)))","v":""},{"$f":"IF($Q257=\"\",\"\",INDEX(zawodniki,SMALL(IF(numerki=$Q257,ROW(numerki)-ROW(J$4)+1),COUNTIF($Q$4:$Q257,$Q257)),COLUMNS($B$8:D139)))","v":""},{"$f":"IF($Q257=\"\",\"\",INDEX(zawodniki,SMALL(IF(numerki=$Q257,ROW(numerki)-ROW(K$4)+1),COUNTIF($Q$4:$Q257,$Q257)),COLUMNS($B$8:E139)))","v":""},{"$f":"IF(ROWS($L$144:L275)>COUNT(numerki),\"\",SMALL(numerki,ROWS($L$144:L275)))","v":""}]

{"sheet":"wklejone_dane","index":2,"n_rows":120,"n_cols":6,"rows_kept":120,"cut":false,"hidden":false,"merged":[]}
[]
[]
["M-ce","NAZWISKO i Imię","rok ur.","Klub","grupa","Kolumna1"]
[1,"GAJDEK Maksymilian ",2014,"UKN LAWORTA Ustrzyki Dolne","Gr. 2",1]
[2,"GAJDEK Tymoteusz ",2012,"UKN LAWORTA Ustrzyki Dolne","Gr. 16",2]
[3,"WĘGLOWSKA Laura ",2005,"UKN LAWORTA Ustrzyki Dolne","Gr. 8",3]
[4,"GAJDEK Filip ",2005,"UKN LAWORTA Ustrzyki Dolne","Gr. 9",4]
["","","","","",""]
["","","","","",""]
["","","","","",""]
["","","","","",""]
["","","","","",""]
["","","","","",""]
["","","","","",""]
["","","","","",""]
["","","","","",""]
["","","","","",""]
["","","","","",""]
["","","","","",""]
["","","","","",""]
["","","","","",""]
["","","","","",""]
["","","","","",""]
["","","","","",""]
["","","","","",""]
["","","","","",""]
["","","","","",""]
["","","","","",""]
["","","","","",""]
["","","","","",""]
["","","","","",""]
["","","","","",""]
["","","","","",""]
["","","","","",""]
["","","","","",""]
["","","","","",""]
["","","","","",""]
["","","","","",""]
["","","","","",""]
["","","","","",""]
["","","","","",""]
["","","","","",""]
["","","","","",""]
["","","","","",""]
["","","","","",""]
["","","","","",""]
["","","","","",""]
["","","","","",""]
["","","","","",""]
["","","","","",""]
["","","","","",""]
["","","","","",""]
["","","","","",""]
["","","","","",""]
["","","","","",""]
["","","","","",""]
["","","","","",""]
["","","","","",""]
["","","","","",""]
["","","","","",""]
["","","","","",""]
["","","","","",""]
["","","","","",""]
["","","","","",""]
["","","","","",""]
["","","","","",""]
["","","","","",""]
["","","","","",""]
["","","","","",""]
["","","","","",""]
["","","","","",""]
["","","","","",""]
["","","","","",""]
["","","","","",""]
["","","","","",""]
["","","","","",""]
["","","","","",""]
["","","","","",""]
["","","","","",""]
["","","","","",""]
["","","","","",""]
["","","","","",""]
["","","","","",""]
["","","","","",""]
["","","","","",""]
["","","","","",""]
["","","","","",""]
["","","","","",""]
["","","","","",""]
["","","","","",""]
["","","","","",""]
["","","","","",""]
["","","","","",""]
["","","","","",""]
["","","","","",""]
["","","","","",""]
["","","","","",""]
["","","","","",""]
["","","","","",""]
["","","","","",""]
["","","","","",""]
["","","","","",""]
["","","","","",""]
["","","","","",""]
["","","","","",""]
["","","","","",""]
["","","","","",""]
["","","","","",""]
["","","","","",""]
["","","","","",""]
["","","","","",""]
["","","","","",""]
["","","","","",""]
["","","","","",""]
["","","","","",""]
["","","","","",""]
["","","","","",""]
["","","","","",""]
["","","","","",""]
["","","","","",""]

{"sheet":"klasyfikacja","index":3,"n_rows":106,"n_cols":27,"rows_kept":106,"cut":false,"hidden":false,"merged":[]}
[null,null,"Klasyfikacja indywidualna po 4 zawodach:",null,null,null,null,null,null,null,null,null,null,null,null,null,null,null,null,null,null,null,"PODKARPACKA LIGA ALPEJSKA DLA DZIECI i MŁODZIEŻY - 2021"]
[null,null,"PODKARPACKA LIGA ALPEJSKA DLA DZIECI i MŁODZIEŻY - 2021",null,null,null,null,null,{"$f":"\"Uczestników: \"&COUNT(Zawody_2021[M-ce])","v":"Uczestników: 103"},null,null,null,null,null,null,null,null,null,null,null,null,null,"Klasyfikacja klubowa po 4 zawodach"]
["M-ce","grupa","NAZWISKO i Imię","rok ur.","Klub","Suma","ile","Zawody_1","Zawody_2","Zawody_3","Zawody_4","Zawody_5","grupa _2",null,null,null,null,null,null,null,"M-ce","Klub","Suma","Zawody_1","Zawody_2","Zawody_3","Zawody_4"]
[1,"Gr. 1","LEŚNIAK Zofia-Katarzyna ",2013,"KN Gondola Krynica",360,6,60,60,60,60,60,1,null,null,null,null,{"$f":"IF(B4=\"\",\"\",MOD(IF(B4=B3,R3,R3+1),2)=1)","v":true},null,null,1,"UKN LAWORTA Ustrzyki Dolne",5724,1426,1432,1392,1474]
[2,"Gr. 1","MACH Milena ",2013,"KN Przemyśl SKI",280,6,30,50,50,50,50,1,null,null,null,null,{"$f":"IF(B5=\"\",\"\",MOD(IF(B5=B4,R4,R4+1),2)=1)","v":true},null,null,2,"KN Przemyśl SKI",2050,631,584,445,390]
[3,"Gr. 1","GRĘDA Agata ",2013,"KN Przemyśl SKI",195,5,50,40,null,35,35,1,null,null,null,null,{"$f":"IF(B6=\"\",\"\",MOD(IF(B6=B5,R5,R5+1),2)=1)","v":true},null,null,3,"KN Gondola Krynica",1110,270,270,290,280]
[4,"Gr. 1","MOSUREK Marcelina ",2013,"UKN LAWORTA Ustrzyki Dolne",175,5,35,30,null,30,40,1,null,null,null,null,{"$f":"IF(B7=\"\",\"\",MOD(IF(B7=B6,R6,R6+1),2)=1)","v":true},null,null,4,"SKN Jasło przy ZSM Nr 1",719,187,151,146,235]
[5,"Gr. 1","MOSUREK Zofia ",2013,"UKN LAWORTA Ustrzyki Dolne",115,3,40,35,null,40,null,1,null,null,null,null,{"$f":"IF(B8=\"\",\"\",MOD(IF(B8=B7,R7,R7+1),2)=1)","v":true},null,null,5,"UKS Śródmieście Przemyśl",489,148,131,120,90]
[6,"Gr. 1","TUREK Karolina ",2013,"UKN LAWORTA Ustrzyki Dolne",30,1,null,null,null,null,null,1,null,null,null,null,{"$f":"IF(B9=\"\",\"\",MOD(IF(B9=B8,R8,R8+1),2)=1)","v":true},null,null,6,"UKS Gwożdzik Gwoźnica D.",348,null,null,135,213]
[7,"Gr. 1","PUCYŁO Michalina ",2013,"UKN LAWORTA Ustrzyki Dolne",30,1,null,null,null,null,30,1,null,null,null,null,{"$f":"IF(B10=\"\",\"\",MOD(IF(B10=B9,R9,R9+1),2)=1)","v":true},null,null,7,"Magura Gorlice",100,null,null,50,50]
[8,"Gr. 1","KOKOSZYŃSKA Zuzanna ",2016,"UKN LAWORTA Ustrzyki Dolne",28,1,null,null,null,null,28,1,null,null,null,null,{"$f":"IF(B11=\"\",\"\",MOD(IF(B11=B10,R10,R10+1),2)=1)","v":true},null,null,8,"PTN Przemyśl",82,56,26]
[1,"Gr. 2","SZUKALSKI Patryk ",2013,"UKN LAWORTA Ustrzyki Dolne",340,6,40,60,60,60,60,2,null,null,null,null,{"$f":"IF(B12=\"\",\"\",MOD(IF(B12=B11,R11,R11+1),2)=1)","v":false}]
[2,"Gr. 2","KULIGOWSKI Jerzy ",2013,"UKS Śródmieście Przemyśl",300,6,60,40,50,50,50,2,null,null,null,null,{"$f":"IF(B13=\"\",\"\",MOD(IF(B13=B12,R12,R12+1),2)=1)","v":false}]
[3,"Gr. 2","GAJDEK Maksymilian ",2014,"UKN LAWORTA Ustrzyki Dolne",220,5,50,50,40,40,null,2,null,null,null,null,{"$f":"IF(B14=\"\",\"\",MOD(IF(B14=B13,R13,R13+1),2)=1)","v":false}]
[4,"Gr. 2","PABIS Filip ",2013,"UKN LAWORTA Ustrzyki Dolne",180,5,null,35,35,35,40,2,null,null,null,null,{"$f":"IF(B15=\"\",\"\",MOD(IF(B15=B14,R14,R14+1),2)=1)","v":false}]
[5,"Gr. 2","SZOPNIEWSKI Michał ",2013,"SKN Jasło przy ZSM Nr 1",140,5,30,30,24,28,null,2,null,null,null,null,{"$f":"IF(B16=\"\",\"\",MOD(IF(B16=B15,R15,R15+1),2)=1)","v":false}]
[6,"Gr. 2","LEJOWSKI Filip ",2013,"UKN LAWORTA Ustrzyki Dolne",88,3,null,null,28,30,null,2,null,null,null,null,{"$f":"IF(B17=\"\",\"\",MOD(IF(B17=B16,R16,R16+1),2)=1)","v":false}]
[7,"Gr. 2","BUGERA Antoni ",2013,"KN Przemyśl SKI",65,2,35,null,30,null,null,2,null,null,null,null,{"$f":"IF(B18=\"\",\"\",MOD(IF(B18=B17,R17,R17+1),2)=1)","v":false}]
[8,"Gr. 2","FUTYMA Igor ",2013,"UKN LAWORTA Ustrzyki Dolne",52,2,null,null,26,null,null,2,null,null,null,null,{"$f":"IF(B19=\"\",\"\",MOD(IF(B19=B18,R18,R18+1),2)=1)","v":false}]
[1,"Gr. 3","LEŚNIAK Zuzanna-Maria ",2011,"KN Gondola Krynica",280,5,60,60,60,60,null,3,null,null,null,null,{"$f":"IF(B20=\"\",\"\",MOD(IF(B20=B19,R19,R19+1),2)=1)","v":true}]
[2,"Gr. 3","DOMAGALSKA Aleksandra ",2012,"KN Przemyśl SKI",250,5,50,40,50,50,null,3,null,null,null,null,{"$f":"IF(B21=\"\",\"\",MOD(IF(B21=B20,R20,R20+1),2)=1)","v":true}]
[3,"Gr. 3","KOCHANOWICZ Nadia ",2012,"UKN LAWORTA Ustrzyki Dolne",170,4,40,50,40,40,null,3,null,null,null,null,{"$f":"IF(B22=\"\",\"\",MOD(IF(B22=B21,R21,R21+1),2)=1)","v":true}]
[4,"Gr. 3","MUCHA Zuzanna",2012,"UKN LAWORTA Ustrzyki Dolne",135,4,35,30,null,35,null,3,null,null,null,null,{"$f":"IF(B23=\"\",\"\",MOD(IF(B23=B22,R22,R22+1),2)=1)","v":true}]
[5,"Gr. 3","PORĘBA Małgorzata ",2012,"UKS Gwożdzik Gwoźnica D.",80,2,null,null,30,null,null,3,null,null,null,null,{"$f":"IF(B24=\"\",\"\",MOD(IF(B24=B23,R23,R23+1),2)=1)","v":true}]
[6,"Gr. 3","KOLII Myroslava ",2012,"UKS Śródmieście Przemyśl",65,2,30,null,35,null,null,3,null,null,null,null,{"$f":"IF(B25=\"\",\"\",MOD(IF(B25=B24,R24,R24+1),2)=1)","v":true}]
[7,"Gr. 3","SMOTRYCKA Zuzanna ",2011,"UKS Śródmieście Przemyśl",35,1,null,35,null,null,null,3,null,null,null,null,{"$f":"IF(B26=\"\",\"\",MOD(IF(B26=B25,R25,R25+1),2)=1)","v":true}]
[1,"Gr. 4","GAJDEK Tymoteusz ",2012,"UKN LAWORTA Ustrzyki Dolne",290,5,60,50,60,60,null,4,null,null,null,null,{"$f":"IF(B27=\"\",\"\",MOD(IF(B27=B26,R26,R26+1),2)=1)","v":false}]
[2,"Gr. 4","MIELNIK Fabian ",2012,"KN Przemyśl SKI",240,5,50,60,30,50,null,4,null,null,null,null,{"$f":"IF(B28=\"\",\"\",MOD(IF(B28=B27,R27,R27+1),2)=1)","v":false}]
[3,"Gr. 4","SARNICKI Antoni ",2012,"KN Przemyśl SKI",170,4,40,40,50,null,null,4,null,null,null,null,{"$f":"IF(B29=\"\",\"\",MOD(IF(B29=B28,R28,R28+1),2)=1)","v":false}]
[4,"Gr. 4","BOCER Jakub ",2012,"UKS Śródmieście Przemyśl",163,5,30,28,35,40,null,4,null,null,null,null,{"$f":"IF(B30=\"\",\"\",MOD(IF(B30=B29,R29,R29+1),2)=1)","v":false}]
[5,"Gr. 4","KOKOSZYŃSKI Franciszek ",2011,"UKN LAWORTA Ustrzyki Dolne",145,4,35,35,40,null,null,4,null,null,null,null,{"$f":"IF(B31=\"\",\"\",MOD(IF(B31=B30,R30,R30+1),2)=1)","v":false}]
[6,"Gr. 4","WRONA Filip ",2012,"UKN LAWORTA Ustrzyki Dolne",58,2,28,30,null,null,null,4,null,null,null,null,{"$f":"IF(B32=\"\",\"\",MOD(IF(B32=B31,R31,R31+1),2)=1)","v":false}]
[7,"Gr. 4","KUŚMIDER Jagoda ",2010,"UKN LAWORTA Ustrzyki Dolne",26,1,26,null,null,null,null,4,null,null,null,null,{"$f":"IF(B33=\"\",\"\",MOD(IF(B33=B32,R32,R32+1),2)=1)","v":false}]
[1,"Gr. 5","BERNAT Kaja ",2010,"KN Gondola Krynica",260,5,50,50,60,50,null,5,null,null,null,null,{"$f":"IF(B34=\"\",\"\",MOD(IF(B34=B33,R33,R33+1),2)=1)","v":true}]
[2,"Gr. 5","LEŚNIAK Helena ",2009,"KN Gondola Krynica",240,4,60,60,null,60,null,5,null,null,null,null,{"$f":"IF(B35=\"\",\"\",MOD(IF(B35=B34,R34,R34+1),2)=1)","v":true}]
[3,"Gr. 5","HENDZEL Maja ",2009,"KN Przemyśl SKI",171,5,40,40,26,30,null,5,null,null,null,null,{"$f":"IF(B36=\"\",\"\",MOD(IF(B36=B35,R35,R35+1),2)=1)","v":true}]
[4,"Gr. 5","GRĘDA Zuzanna ",2009,"KN Przemyśl SKI",156,5,30,35,35,28,null,5,null,null,null,null,{"$f":"IF(B37=\"\",\"\",MOD(IF(B37=B36,R36,R36+1),2)=1)","v":true}]
[5,"Gr. 5","DACKO Emilia ",2009,"UKN LAWORTA Ustrzyki Dolne",130,3,null,null,50,40,null,5,null,null,null,null,{"$f":"IF(B38=\"\",\"\",MOD(IF(B38=B37,R37,R37+1),2)=1)","v":true}]
[6,"Gr. 5","MACH Martyna ",2010,"KN Przemyśl SKI",119,4,35,30,28,26,null,5,null,null,null,null,{"$f":"IF(B39=\"\",\"\",MOD(IF(B39=B38,R38,R38+1),2)=1)","v":true}]
[7,"Gr. 5","DOŁŻYCKA Lena ",2009,"UKN LAWORTA Ustrzyki Dolne",105,3,null,null,40,35,null,5,null,null,null,null,{"$f":"IF(B40=\"\",\"\",MOD(IF(B40=B39,R39,R39+1),2)=1)","v":true}]
[8,"Gr. 5","FUTYMA Wiktoria ",2009,"UKN LAWORTA Ustrzyki Dolne",80,3,null,null,30,24,null,5,null,null,null,null,{"$f":"IF(B41=\"\",\"\",MOD(IF(B41=B40,R40,R40+1),2)=1)","v":true}]
[9,"Gr. 5","NIKODY Aleksandra ",2009,"SKN Jasło przy ZSM Nr 1",70,3,null,null,24,22,null,5,null,null,null,null,{"$f":"IF(B42=\"\",\"\",MOD(IF(B42=B41,R41,R41+1),2)=1)","v":true}]
[10,"Gr. 5","KULIGOWSKA Zofia ",2010,"UKS Śródmieście Przemyśl",56,2,28,28,null,null,null,5,null,null,null,null,{"$f":"IF(B43=\"\",\"\",MOD(IF(B43=B42,R42,R42+1),2)=1)","v":true}]
[1,"Gr. 6","SEMP Damian ",2009,"KN Przemyśl SKI",270,5,60,50,50,60,null,6,null,null,null,null,{"$f":"IF(B44=\"\",\"\",MOD(IF(B44=B43,R43,R43+1),2)=1)","v":false}]
[2,"Gr. 6","ROGALIŃSKI Stefan ",2010,"UKN LAWORTA Ustrzyki Dolne",245,5,50,40,60,35,null,6,null,null,null,null,{"$f":"IF(B45=\"\",\"\",MOD(IF(B45=B44,R44,R44+1),2)=1)","v":false}]
[3,"Gr. 6","JANDURA Adam ",2009,"SKN Jasło przy ZSM Nr 1",166,5,28,28,35,40,null,6,null,null,null,null,{"$f":"IF(B46=\"\",\"\",MOD(IF(B46=B45,R45,R45+1),2)=1)","v":false}]
[4,"Gr. 6","SZOPNIEWSKI Adam ",2009,"SKN Jasło przy ZSM Nr 1",155,4,35,30,null,50,null,6,null,null,null,null,{"$f":"IF(B47=\"\",\"\",MOD(IF(B47=B46,R46,R46+1),2)=1)","v":false}]
[5,"Gr. 6","KUŁAK Szymon ",2009,"KN Przemyśl SKI",115,3,40,35,40,null,null,6,null,null,null,null,{"$f":"IF(B48=\"\",\"\",MOD(IF(B48=B47,R47,R47+1),2)=1)","v":false}]
[6,"Gr. 6","KUTER Krzysztof ",2009,"UKN LAWORTA Ustrzyki Dolne",90,2,null,60,null,30,null,6,null,null,null,null,{"$f":"IF(B49=\"\",\"\",MOD(IF(B49=B48,R48,R48+1),2)=1)","v":false}]
[7,"Gr. 6","ŁUKASIEWICZ Olek ",2009,"PTN Przemyśl",56,2,30,26,null,null,null,6,null,null,null,null,{"$f":"IF(B50=\"\",\"\",MOD(IF(B50=B49,R49,R49+1),2)=1)","v":false}]
[8,"Gr. 6","WOŚ Michał",2010,"UKS Śródmieście Przemyśl",30,1,null,null,null,null,null,6,null,null,null,null,{"$f":"IF(B51=\"\",\"\",MOD(IF(B51=B50,R50,R50+1),2)=1)","v":false}]
[9,"Gr. 6","WIKTORSKI Kacper",2009,"UKN LAWORTA Ustrzyki Dolne",28,1,null,null,null,null,null,6,null,null,null,null,{"$f":"IF(B52=\"\",\"\",MOD(IF(B52=B51,R51,R51+1),2)=1)","v":false}]
[10,"Gr. 6","DZIURZYŃSKI Szymon ",2010,"PTN Przemyśl",26,1,26,null,null,null,null,6,null,null,null,null,{"$f":"IF(B53=\"\",\"\",MOD(IF(B53=B52,R52,R52+1),2)=1)","v":false}]
[1,"Gr. 7","KĄDZIOŁKA Pola ",2007,"UKN LAWORTA Ustrzyki Dolne",300,5,60,60,60,60,null,7,null,null,null,null,{"$f":"IF(B54=\"\",\"\",MOD(IF(B54=B53,R53,R53+1),2)=1)","v":true}]
[2,"Gr. 7","KOWALSKA Julia ",2008,"UKN LAWORTA Ustrzyki Dolne",225,5,50,40,50,50,null,7,null,null,null,null,{"$f":"IF(B55=\"\",\"\",MOD(IF(B55=B54,R54,R54+1),2)=1)","v":true}]
[3,"Gr. 7","ELMERYCH Maria ",2008,"UKN LAWORTA Ustrzyki Dolne",180,4,40,50,null,40,null,7,null,null,null,null,{"$f":"IF(B56=\"\",\"\",MOD(IF(B56=B55,R55,R55+1),2)=1)","v":true}]
[4,"Gr. 7","KOCHANOWICZ Blanka ",2008,"UKN LAWORTA Ustrzyki Dolne",170,5,35,30,35,30,null,7,null,null,null,null,{"$f":"IF(B57=\"\",\"\",MOD(IF(B57=B56,R56,R56+1),2)=1)","v":true}]
[5,"Gr. 7","BAŁABAN Maria ",2007,"UKN LAWORTA Ustrzyki Dolne",163,5,30,35,40,28,null,7,null,null,null,null,{"$f":"IF(B58=\"\",\"\",MOD(IF(B58=B57,R57,R57+1),2)=1)","v":true}]
[6,"Gr. 7","STRUSIEWICZ Julia ",2007,"UKN LAWORTA Ustrzyki Dolne",115,4,26,26,28,35,null,7,null,null,null,null,{"$f":"IF(B59=\"\",\"\",MOD(IF(B59=B58,R58,R58+1),2)=1)","v":true}]
[7,"Gr. 7","SOWA Nikola ",2007,"KN Przemyśl SKI",98,4,22,24,26,26,null,7,null,null,null,null,{"$f":"IF(B60=\"\",\"\",MOD(IF(B60=B59,R59,R59+1),2)=1)","v":true}]
[8,"Gr. 7","DZIWISZ Julia ",2008,"UKN LAWORTA Ustrzyki Dolne",86,3,28,28,30,null,null,7,null,null,null,null,{"$f":"IF(B61=\"\",\"\",MOD(IF(B61=B60,R60,R60+1),2)=1)","v":true}]
[9,"Gr. 7","DACKO Pola ",2008,"UKN LAWORTA Ustrzyki Dolne",52,2,null,null,null,24,null,7,null,null,null,null,{"$f":"IF(B62=\"\",\"\",MOD(IF(B62=B61,R61,R61+1),2)=1)","v":true}]
[10,"Gr. 7","KĘSICKA Lilianna ",2007,"KN Przemyśl SKI",24,1,24,null,null,null,null,7,null,null,null,null,{"$f":"IF(B63=\"\",\"\",MOD(IF(B63=B62,R62,R62+1),2)=1)","v":true}]
[1,"Gr. 8","BERNAT Karol ",2007,"KN Gondola Krynica",300,5,60,60,60,60,null,8,null,null,null,null,{"$f":"IF(B64=\"\",\"\",MOD(IF(B64=B63,R63,R63+1),2)=1)","v":false}]
[2,"Gr. 8","WIEJOWSKI Michał ",2008,"KN Gondola Krynica",230,5,40,40,50,50,null,8,null,null,null,null,{"$f":"IF(B65=\"\",\"\",MOD(IF(B65=B64,R64,R64+1),2)=1)","v":false}]
[3,"Gr. 8","JUCOS Piotr ",2008,"UKN LAWORTA Ustrzyki Dolne",185,5,35,35,40,40,null,8,null,null,null,null,{"$f":"IF(B66=\"\",\"\",MOD(IF(B66=B65,R65,R65+1),2)=1)","v":false}]
[4,"Gr. 8","TŁUCZEK Kasper ",2007,"KN Przemyśl SKI",165,5,30,30,30,35,null,8,null,null,null,null,{"$f":"IF(B67=\"\",\"\",MOD(IF(B67=B66,R66,R66+1),2)=1)","v":false}]
[5,"Gr. 8","KRYDA Mikołaj ",2008,"UKN LAWORTA Ustrzyki Dolne",158,4,50,50,null,28,null,8,null,null,null,null,{"$f":"IF(B68=\"\",\"\",MOD(IF(B68=B67,R67,R67+1),2)=1)","v":false}]
[6,"Gr. 8","BIERNACKI Kacper ",2008,"SKN Jasło przy ZSM Nr 1",114,4,28,null,28,30,null,8,null,null,null,null,{"$f":"IF(B69=\"\",\"\",MOD(IF(B69=B68,R68,R68+1),2)=1)","v":false}]
[7,"Gr. 8","KRYDA Mikołam ",2008,"UKN LAWORTA Ustrzyki Dolne",35,1,null,null,35,null,null,8,null,null,null,null,{"$f":"IF(B70=\"\",\"\",MOD(IF(B70=B69,R69,R69+1),2)=1)","v":false}]
[8,"Gr. 8","KOWALSKI Kamil ",2008,"UKN LAWORTA Ustrzyki Dolne",28,1,null,28,null,null,null,8,null,null,null,null,{"$f":"IF(B71=\"\",\"\",MOD(IF(B71=B70,R70,R70+1),2)=1)","v":false}]
[1,"Gr. 9","WĘGLOWSKA Laura ",2005,"UKN LAWORTA Ustrzyki Dolne",120,2,null,null,null,60,null,9,null,null,null,null,{"$f":"IF(B72=\"\",\"\",MOD(IF(B72=B71,R71,R71+1),2)=1)","v":true}]
[2,"Gr. 9","KUTER Katarzyna ",2005,"UKN LAWORTA Ustrzyki Dolne",60,1,null,null,60,null,null,9,null,null,null,null,{"$f":"IF(B73=\"\",\"\",MOD(IF(B73=B72,R72,R72+1),2)=1)","v":true}]
[3,"Gr. 9","WOLAN Sylwia",2006,"UKS Gwożdzik Gwoźnica D.",50,1,null,null,null,null,null,9,null,null,null,null,{"$f":"IF(B74=\"\",\"\",MOD(IF(B74=B73,R73,R73+1),2)=1)","v":true}]
[1,"Gr. 10","GAJDEK Filip ",2005,"UKN LAWORTA Ustrzyki Dolne",260,5,50,60,40,50,null,10,null,null,null,null,{"$f":"IF(B75=\"\",\"\",MOD(IF(B75=B74,R74,R74+1),2)=1)","v":false}]
[2,"Gr. 10","GRĘDA Jakub ",2006,"UKN LAWORTA Ustrzyki Dolne",230,4,60,50,60,60,null,10,null,null,null,null,{"$f":"IF(B76=\"\",\"\",MOD(IF(B76=B75,R75,R75+1),2)=1)","v":false}]
[3,"Gr. 10","SZCZEPAŃSKI Jan ",2006,"UKN LAWORTA Ustrzyki Dolne",170,4,40,40,null,40,null,10,null,null,null,null,{"$f":"IF(B77=\"\",\"\",MOD(IF(B77=B76,R76,R76+1),2)=1)","v":false}]
[4,"Gr. 10","FISCHER Rafał ",2006,"UKN LAWORTA Ustrzyki Dolne",150,4,30,null,50,30,null,10,null,null,null,null,{"$f":"IF(B78=\"\",\"\",MOD(IF(B78=B77,R77,R77+1),2)=1)","v":false}]
[5,"Gr. 10","DAROSZ Kacper ",2005,"UKN LAWORTA Ustrzyki Dolne",140,4,35,35,35,35,null,10,null,null,null,null,{"$f":"IF(B79=\"\",\"\",MOD(IF(B79=B78,R78,R78+1),2)=1)","v":false}]
[6,"Gr. 10","PIĘKOŚ Jakub ",2005,"SKN Jasło przy ZSM Nr 1",84,3,26,28,null,null,null,10,null,null,null,null,{"$f":"IF(B80=\"\",\"\",MOD(IF(B80=B79,R79,R79+1),2)=1)","v":false}]
[7,"Gr. 10","WITKA Jakub ",2005,"UKN LAWORTA Ustrzyki Dolne",58,2,28,30,null,null,null,10,null,null,null,null,{"$f":"IF(B81=\"\",\"\",MOD(IF(B81=B80,R80,R80+1),2)=1)","v":false}]
[8,"Gr. 10","SZOPNIEWSKI Kamil ",2005,"SKN Jasło przy ZSM Nr 1",35,1,null,null,null,null,null,10,null,null,null,null,{"$f":"IF(B82=\"\",\"\",MOD(IF(B82=B81,R81,R81+1),2)=1)","v":false}]
[9,"Gr. 10","DROZD Sebastian ",2006,"UKS Gwożdzik Gwoźnica D.",28,1,null,null,null,28,null,10,null,null,null,null,{"$f":"IF(B83=\"\",\"\",MOD(IF(B83=B82,R82,R82+1),2)=1)","v":false}]
[1,"Gr. 11","KĄDZIOŁKA Oliwia ",2003,"UKN LAWORTA Ustrzyki Dolne",300,5,60,60,60,60,null,11,null,null,null,null,{"$f":"IF(B84=\"\",\"\",MOD(IF(B84=B83,R83,R83+1),2)=1)","v":true}]
[2,"Gr. 11","GAWLIK Jagoda ",2003,"UKN LAWORTA Ustrzyki Dolne",250,5,50,50,50,50,null,11,null,null,null,null,{"$f":"IF(B85=\"\",\"\",MOD(IF(B85=B84,R84,R84+1),2)=1)","v":true}]
[1,"Gr. 12","OSIADACZ Brian ",2004,"UKN LAWORTA Ustrzyki Dolne",280,5,50,60,50,60,null,12,null,null,null,null,{"$f":"IF(B86=\"\",\"\",MOD(IF(B86=B85,R85,R85+1),2)=1)","v":false}]
[2,"Gr. 12","BABIARZ Dawid ",2002,"UKN LAWORTA Ustrzyki Dolne",170,3,60,null,60,null,null,12,null,null,null,null,{"$f":"IF(B87=\"\",\"\",MOD(IF(B87=B86,R86,R86+1),2)=1)","v":false}]
[3,"Gr. 12","DROZD Krystian ",2003,"UKS Gwożdzik Gwoźnica D.",130,3,null,null,40,50,null,12,null,null,null,null,{"$f":"IF(B88=\"\",\"\",MOD(IF(B88=B87,R87,R87+1),2)=1)","v":false}]
[4,"Gr. 12","WOLAN Mateusz ",2003,"UKS Gwożdzik Gwoźnica D.",110,3,null,null,35,40,null,12,null,null,null,null,{"$f":"IF(B89=\"\",\"\",MOD(IF(B89=B88,R88,R88+1),2)=1)","v":false}]
[5,"Gr. 12","SOŁTYS Mateusz ",2002,"UKS Gwożdzik Gwoźnica D.",35,1,null,null,null,35,null,12,null,null,null,null,{"$f":"IF(B90=\"\",\"\",MOD(IF(B90=B89,R89,R89+1),2)=1)","v":false}]
[1,"Gr. 13","KULIGOWSKA Oliwia ",1996,"KN Przemyśl SKI",120,2,60,60,null,null,null,13,null,null,null,null,{"$f":"IF(B91=\"\",\"\",MOD(IF(B91=B90,R90,R90+1),2)=1)","v":true}]
[1,"Gr. 14","PIĘCIAK Konrad",1988,"UKS Gwożdzik Gwoźnica D.",95,2,null,null,null,60,null,14,null,null,null,null,{"$f":"IF(B92=\"\",\"\",MOD(IF(B92=B91,R91,R91+1),2)=1)","v":false}]
[2,"Gr. 14","NOWAK Michał",1993,"UKN LAWORTA Ustrzyki Dolne",60,1,null,null,null,null,null,14,null,null,null,null,{"$f":"IF(B106=\"\",\"\",MOD(IF(B106=B92,R92,R92+1),2)=1)","v":true}]
[3,"Gr. 14","OSTROWSKI Tomasz",1983,"UKN LAWORTA Ustrzyki Dolne",50,1,null,null,null,null,null,14,null,null,null,null,null,{"$f":"IF(B107=\"\",\"\",MOD(IF(B107=B106,R93,R93+1),2)=1)","v":""}]
[4,"Gr. 14","SMOLARZ Przemysław",1999,"UKS Gwożdzik Gwoźnica D.",40,1,null,null,null,null,null,14,null,null,null,null,null,{"$f":"IF(B108=\"\",\"\",MOD(IF(B108=B107,S94,S94+1),2)=1)","v":""}]
[1,"Gr. 16","ELMERYCH Paweł ",1975,"UKN LAWORTA Ustrzyki Dolne",300,5,60,60,60,60,null,16,null,null,null,null,null,{"$f":"IF(B109=\"\",\"\",MOD(IF(B109=B108,S95,S95+1),2)=1)","v":""}]
[2,"Gr. 16","BABIARZ Wacław ",1969,"UKN LAWORTA Ustrzyki Dolne",196,5,50,40,40,40,null,16,null,null,null,null,null,{"$f":"IF(B110=\"\",\"\",MOD(IF(B110=B109,S96,S96+1),2)=1)","v":""}]
[3,"Gr. 16","WÓJCIK Tadeusz ",1950,"SKN Jasło przy ZSM Nr 1",169,5,40,35,35,35,null,16,null,null,null,null,null,{"$f":"IF(B111=\"\",\"\",MOD(IF(B111=B110,S97,S97+1),2)=1)","v":""}]
[4,"Gr. 16","PROBULSKI Zbigniew ",1953,"Magura Gorlice",150,3,null,null,50,50,null,16,null,null,null,null,null,{"$f":"IF(B112=\"\",\"\",MOD(IF(B112=B111,S98,S98+1),2)=1)","v":""}]
[5,"Gr. 16","GUDZELAK Józef ",1948,"KN Przemyśl SKI",85,2,35,50,null,null,null,16,null,null,null,null,null,{"$f":"IF(B113=\"\",\"\",MOD(IF(B113=B112,S99,S99+1),2)=1)","v":""}]
[6,"Gr. 16","PORĘBA Adam ",1971,"UKS Gwożdzik Gwoźnica D.",52,2,null,null,30,null,null,16,null,null,null,null,null,{"$f":"IF(B114=\"\",\"\",MOD(IF(B114=B113,S100,S100+1),2)=1)","v":""}]
[7,"Gr. 16","CZELNY Janusz",1964,"Niestowarzyszony",40,1,null,null,null,null,null,16,null,null,null,null,null,{"$f":"IF(B115=\"\",\"\",MOD(IF(B115=B114,S101,S101+1),2)=1)","v":""}]
[8,"Gr. 16","PIĘKOŚ ANDRZEJ",1962,"SKN Jasło przy ZSM Nr 1",35,1,null,null,null,null,null,16,null,null,null,null,null,{"$f":"IF(B116=\"\",\"\",MOD(IF(B116=B115,S102,S102+1),2)=1)","v":""}]
[9,"Gr. 16","SZOPNIEWSKI Daniel ",1977,"SKN Jasło przy ZSM Nr 1",30,1,null,null,null,30,null,16,null,null,null,null,null,{"$f":"IF(B117=\"\",\"\",MOD(IF(B117=B116,S103,S103+1),2)=1)","v":""}]
[10,"Gr. 16","BOBKO Zygmunt ",1956,"KN Przemyśl SKI",30,1,null,null,null,null,null,16]
[11,"Gr. 16","KOZA Maciej",1974,"Niestowarzyszony",28,1,null,null,null,null,null,16]

{"sheet":"Zawody_2021_klubowa","index":4,"n_rows":11,"n_cols":9,"rows_kept":11,"cut":false,"hidden":false,"merged":[]}
[null,"Klasyfikacja klubowa po VI zawodach"]
["M-ce","Klub","Suma","Zawody_1","Zawody_2","Zawody_3","Zawody_4","Zawody_5","Zawody_6"]
[1,"UKN LAWORTA Ustrzyki Dolne",8479,1366,1372,1392,1414,1426,1509]
[2,"KN Przemyśl SKI",2937,631,584,445,390,469,418]
[3,"KN Gondola Krynica",1880,330,330,290,340,270,320]
[4,"SKN Jasło przy ZSM Nr 1",1207,187,151,146,235,209,279]
[5,"UKS Gwożdzik Gwoźnica D.",935,null,null,135,213,315,272]
[6,"UKS Śródmieście Przemyśl",677,148,131,120,90,78,110]
[7,"Magura Gorlice",200,null,null,50,50,50,50]
[8,"Niestowarzyszony",134,null,null,null,null,66,68]
[9,"PTN Przemyśl",82,56,26]

{"sheet":"klas_indywidualna","index":5,"n_rows":113,"n_cols":30,"rows_kept":113,"cut":false,"hidden":false,"merged":[]}
[null,null,"Klasyfikacja po VI zawodach \n(z uwzględnieniem zasady: 6 zawodów minus najsłabszy wynik.\nNatomiast zawodnicy, którzy nie uczestniczyli we wszyskich zawodach otrzymali sumę punktów)",null,null,null,null,null,null,null,null,null,null,null,null,null,null,null,null,null,null,null,"Klasyfikacja klubowa po VI zawodach"]
["M-ce","Grupa","NAZWISKO i Imię","rok. ur.","Klub","liczba","wynik","Zawody_1","Zawody_2","Zawody_3","Zawody_4","Zawody_5","Zawody_6",null,null,null,null,null,null,null,null,"M-ce","Klub","Suma","Zawody_1","Zawody_2","Zawody_3","Zawody_4","Zawody_5","Zawody_6"]
[{"$f":"IF(Zawody_2021_klas_indywidualna[[#This Row],[Grupa]]=\"\",\"\",COUNTIF($B$3:B3,B3))","v":1},"Gr. 1","LEŚNIAK Zofia-Katarzyna ",2013,"KN Gondola Krynica",6,300,60,60,60,60,60,60,null,null,null,null,{"$f":"IF(B3=\"\",\"\",MOD(IF(B3=B2,R2,R2+1),2)=1)","v":true},null,null,null,1,"UKN LAWORTA Ustrzyki Dolne",8479,1366,1372,1392,1414,1426,1509]
[{"$f":"IF(Zawody_2021_klas_indywidualna[[#This Row],[Grupa]]=\"\",\"\",COUNTIF($B$3:B4,B4))","v":2},"Gr. 1","MACH Milena ",2013,"KN Przemyśl SKI",6,250,30,50,50,50,50,50,null,null,null,null,true,null,null,null,2,"KN Przemyśl SKI",2937,631,584,445,390,469,418]
[{"$f":"IF(Zawody_2021_klas_indywidualna[[#This Row],[Grupa]]=\"\",\"\",COUNTIF($B$3:B5,B5))","v":3},"Gr. 1","GRĘDA Agata ",2013,"KN Przemyśl SKI",5,195,50,40,null,35,35,35,null,null,null,null,true,null,null,null,3,"KN Gondola Krynica",1880,330,330,290,340,270,320]
[{"$f":"IF(Zawody_2021_klas_indywidualna[[#This Row],[Grupa]]=\"\",\"\",COUNTIF($B$3:B6,B6))","v":4},"Gr. 1","MOSUREK Marcelina ",2013,"UKN LAWORTA Ustrzyki Dolne",5,175,35,30,null,30,40,40,null,null,null,null,true,null,null,null,4,"SKN Jasło przy ZSM Nr 1",1207,187,151,146,235,209,279]
[{"$f":"IF(Zawody_2021_klas_indywidualna[[#This Row],[Grupa]]=\"\",\"\",COUNTIF($B$3:B7,B7))","v":5},"Gr. 1","MOSUREK Zofia ",2013,"UKN LAWORTA Ustrzyki Dolne",3,115,40,35,null,40,null,null,null,null,null,null,true,null,null,null,5,"UKS Gwożdzik Gwoźnica D.",935,null,null,135,213,315,272]
[{"$f":"IF(Zawody_2021_klas_indywidualna[[#This Row],[Grupa]]=\"\",\"\",COUNTIF($B$3:B8,B8))","v":6},"Gr. 1","TUREK Karolina ",2013,"UKN LAWORTA Ustrzyki Dolne",1,30,null,null,null,null,null,30,null,null,null,null,true,null,null,null,6,"UKS Śródmieście Przemyśl",677,148,131,120,90,78,110]
[{"$f":"IF(Zawody_2021_klas_indywidualna[[#This Row],[Grupa]]=\"\",\"\",COUNTIF($B$3:B9,B9))","v":7},"Gr. 1","PUCYŁO Michalina ",2013,"UKN LAWORTA Ustrzyki Dolne",1,30,null,null,null,null,30,null,null,null,null,null,true,null,null,null,7,"Magura Gorlice",200,null,null,50,50,50,50]
[{"$f":"IF(Zawody_2021_klas_indywidualna[[#This Row],[Grupa]]=\"\",\"\",COUNTIF($B$3:B10,B10))","v":8},"Gr. 1","KOKOSZYŃSKA Zuzanna ",2016,"UKN LAWORTA Ustrzyki Dolne",1,28,null,null,null,null,28,null,null,null,null,null,true,null,null,null,8,"Niestowarzyszony",134,null,null,null,null,66,68]
[{"$f":"IF(Zawody_2021_klas_indywidualna[[#This Row],[Grupa]]=\"\",\"\",COUNTIF($B$3:B11,B11))","v":1},"Gr. 2","SZUKALSKI Patryk ",2013,"UKN LAWORTA Ustrzyki Dolne",6,300,40,60,60,60,60,60,null,null,null,null,false,null,null,null,9,"PTN Przemyśl",82,56,26]
[{"$f":"IF(Zawody_2021_klas_indywidualna[[#This Row],[Grupa]]=\"\",\"\",COUNTIF($B$3:B12,B12))","v":2},"Gr. 2","KULIGOWSKI Jerzy ",2013,"UKS Śródmieście Przemyśl",6,260,60,40,50,50,50,50,null,null,null,null,false]
[{"$f":"IF(Zawody_2021_klas_indywidualna[[#This Row],[Grupa]]=\"\",\"\",COUNTIF($B$3:B13,B13))","v":3},"Gr. 2","GAJDEK Maksymilian ",2014,"UKN LAWORTA Ustrzyki Dolne",6,220,50,50,40,40,35,40,null,null,null,null,false]
[{"$f":"IF(Zawody_2021_klas_indywidualna[[#This Row],[Grupa]]=\"\",\"\",COUNTIF($B$3:B14,B14))","v":4},"Gr. 2","PABIS Filip ",2013,"UKN LAWORTA Ustrzyki Dolne",5,180,null,35,35,35,40,35,null,null,null,null,false]
[{"$f":"IF(Zawody_2021_klas_indywidualna[[#This Row],[Grupa]]=\"\",\"\",COUNTIF($B$3:B15,B15))","v":5},"Gr. 2","SZOPNIEWSKI Michał ",2013,"SKN Jasło przy ZSM Nr 1",6,144,30,30,24,28,28,28,null,null,null,null,false]
[{"$f":"IF(Zawody_2021_klas_indywidualna[[#This Row],[Grupa]]=\"\",\"\",COUNTIF($B$3:B16,B16))","v":6},"Gr. 2","LEJOWSKI Filip ",2013,"UKN LAWORTA Ustrzyki Dolne",4,118,null,null,28,30,30,30,null,null,null,null,false]
[{"$f":"IF(Zawody_2021_klas_indywidualna[[#This Row],[Grupa]]=\"\",\"\",COUNTIF($B$3:B17,B17))","v":7},"Gr. 2","BUGERA Antoni ",2013,"KN Przemyśl SKI",2,65,35,null,30,null,null,null,null,null,null,null,false]
[{"$f":"IF(Zawody_2021_klas_indywidualna[[#This Row],[Grupa]]=\"\",\"\",COUNTIF($B$3:B18,B18))","v":8},"Gr. 2","FUTYMA Igor ",2013,"UKN LAWORTA Ustrzyki Dolne",2,52,null,null,26,null,null,26,null,null,null,null,false]
[{"$f":"IF(Zawody_2021_klas_indywidualna[[#This Row],[Grupa]]=\"\",\"\",COUNTIF($B$3:B19,B19))","v":9},"Gr. 2","MŁYNARCZYK Maja",2010,"Niestowarzyszony",1,26,null,null,null,null,26,null,null,null,null,null,false]
[{"$f":"IF(Zawody_2021_klas_indywidualna[[#This Row],[Grupa]]=\"\",\"\",COUNTIF($B$3:B20,B20))","v":1},"Gr. 3","LEŚNIAK Zuzanna-Maria ",2011,"KN Gondola Krynica",6,300,60,60,60,60,60,40,null,null,null,null,true]
[{"$f":"IF(Zawody_2021_klas_indywidualna[[#This Row],[Grupa]]=\"\",\"\",COUNTIF($B$3:B21,B21))","v":2},"Gr. 3","DOMAGALSKA Aleksandra ",2012,"KN Przemyśl SKI",6,260,50,40,50,50,50,60,null,null,null,null,true]
[{"$f":"IF(Zawody_2021_klas_indywidualna[[#This Row],[Grupa]]=\"\",\"\",COUNTIF($B$3:B22,B22))","v":3},"Gr. 3","MUCHA Zuzanna",2012,"UKN LAWORTA Ustrzyki Dolne",5,175,35,30,null,35,40,35,null,null,null,null,true]
[{"$f":"IF(Zawody_2021_klas_indywidualna[[#This Row],[Grupa]]=\"\",\"\",COUNTIF($B$3:B23,B23))","v":4},"Gr. 3","KOCHANOWICZ Nadia ",2012,"UKN LAWORTA Ustrzyki Dolne",4,170,40,50,40,40,null,null,null,null,null,null,true]
[{"$f":"IF(Zawody_2021_klas_indywidualna[[#This Row],[Grupa]]=\"\",\"\",COUNTIF($B$3:B24,B24))","v":5},"Gr. 3","PORĘBA Małgorzata ",2012,"UKS Gwożdzik Gwoźnica D.",2,80,null,null,30,null,null,50,null,null,null,null,true]
[{"$f":"IF(Zawody_2021_klas_indywidualna[[#This Row],[Grupa]]=\"\",\"\",COUNTIF($B$3:B25,B25))","v":6},"Gr. 3","KOLII Myroslava ",2012,"UKS Śródmieście Przemyśl",2,65,30,null,35,null,null,null,null,null,null,null,true]
[{"$f":"IF(Zawody_2021_klas_indywidualna[[#This Row],[Grupa]]=\"\",\"\",COUNTIF($B$3:B26,B26))","v":7},"Gr. 3","SMOTRYCKA Zuzanna ",2011,"UKS Śródmieście Przemyśl",1,35,null,35,null,null,null,null,null,null,null,null,true]
[{"$f":"IF(Zawody_2021_klas_indywidualna[[#This Row],[Grupa]]=\"\",\"\",COUNTIF($B$3:B27,B27))","v":1},"Gr. 4","GAJDEK Tymoteusz ",2012,"UKN LAWORTA Ustrzyki Dolne",6,300,60,50,60,60,60,60,null,null,null,null,false]
[{"$f":"IF(Zawody_2021_klas_indywidualna[[#This Row],[Grupa]]=\"\",\"\",COUNTIF($B$3:B28,B28))","v":2},"Gr. 4","MIELNIK Fabian ",2012,"KN Przemyśl SKI",6,260,50,60,30,50,50,50,null,null,null,null,false]
[{"$f":"IF(Zawody_2021_klas_indywidualna[[#This Row],[Grupa]]=\"\",\"\",COUNTIF($B$3:B29,B29))","v":3},"Gr. 4","KOKOSZYŃSKI Franciszek ",2011,"UKN LAWORTA Ustrzyki Dolne",5,185,35,35,40,null,40,35,null,null,null,null,false]
[{"$f":"IF(Zawody_2021_klas_indywidualna[[#This Row],[Grupa]]=\"\",\"\",COUNTIF($B$3:B30,B30))","v":4},"Gr. 4","SARNICKI Antoni ",2012,"KN Przemyśl SKI",4,170,40,40,50,null,null,40,null,null,null,null,false]
[{"$f":"IF(Zawody_2021_klas_indywidualna[[#This Row],[Grupa]]=\"\",\"\",COUNTIF($B$3:B31,B31))","v":5},"Gr. 4","BOCER Jakub ",2012,"UKS Śródmieście Przemyśl",5,163,30,28,35,40,null,30,null,null,null,null,false]
[{"$f":"IF(Zawody_2021_klas_indywidualna[[#This Row],[Grupa]]=\"\",\"\",COUNTIF($B$3:B32,B32))","v":6},"Gr. 4","WRONA Filip ",2012,"UKN LAWORTA Ustrzyki Dolne",2,58,28,30,null,null,null,null,null,null,null,null,false]
[{"$f":"IF(Zawody_2021_klas_indywidualna[[#This Row],[Grupa]]=\"\",\"\",COUNTIF($B$3:B33,B33))","v":7},"Gr. 4","KUŚMIDER Jagoda ",2010,"UKN LAWORTA Ustrzyki Dolne",1,26,26,null,null,null,null,null,null,null,null,null,false]
[{"$f":"IF(Zawody_2021_klas_indywidualna[[#This Row],[Grupa]]=\"\",\"\",COUNTIF($B$3:B34,B34))","v":1},"Gr. 5","LEŚNIAK Helena ",2009,"KN Gondola Krynica",5,300,60,60,null,60,60,60,null,null,null,null,true]
[{"$f":"IF(Zawody_2021_klas_indywidualna[[#This Row],[Grupa]]=\"\",\"\",COUNTIF($B$3:B35,B35))","v":2},"Gr. 5","BERNAT Kaja ",2010,"KN Gondola Krynica",5,260,50,50,60,50,null,50,null,null,null,null,{"$f":"IF(B35=\"\",\"\",MOD(IF(B35=B34,R34,R34+1),2)=1)","v":true}]
[{"$f":"IF(Zawody_2021_klas_indywidualna[[#This Row],[Grupa]]=\"\",\"\",COUNTIF($B$3:B36,B36))","v":3},"Gr. 5","HENDZEL Maja ",2009,"KN Przemyśl SKI",6,185,40,40,26,30,40,35,null,null,null,null,true]
[{"$f":"IF(Zawody_2021_klas_indywidualna[[#This Row],[Grupa]]=\"\",\"\",COUNTIF($B$3:B37,B37))","v":4},"Gr. 5","DACKO Emilia ",2009,"UKN LAWORTA Ustrzyki Dolne",4,180,null,null,50,40,50,40,null,null,null,null,true]
[{"$f":"IF(Zawody_2021_klas_indywidualna[[#This Row],[Grupa]]=\"\",\"\",COUNTIF($B$3:B38,B38))","v":5},"Gr. 5","GRĘDA Zuzanna ",2009,"KN Przemyśl SKI",6,163,30,35,35,28,35,28,null,null,null,null,true]
[{"$f":"IF(Zawody_2021_klas_indywidualna[[#This Row],[Grupa]]=\"\",\"\",COUNTIF($B$3:B39,B39))","v":6},"Gr. 5","MACH Martyna ",2010,"KN Przemyśl SKI",5,147,35,30,28,26,28,null,null,null,null,null,true]
[{"$f":"IF(Zawody_2021_klas_indywidualna[[#This Row],[Grupa]]=\"\",\"\",COUNTIF($B$3:B40,B40))","v":7},"Gr. 5","FUTYMA Wiktoria ",2009,"UKN LAWORTA Ustrzyki Dolne",4,110,null,null,30,24,30,26,null,null,null,null,true]
[{"$f":"IF(Zawody_2021_klas_indywidualna[[#This Row],[Grupa]]=\"\",\"\",COUNTIF($B$3:B41,B41))","v":8},"Gr. 5","DOŁŻYCKA Lena ",2009,"UKN LAWORTA Ustrzyki Dolne",3,105,null,null,40,35,null,30,null,null,null,null,true]
[{"$f":"IF(Zawody_2021_klas_indywidualna[[#This Row],[Grupa]]=\"\",\"\",COUNTIF($B$3:B42,B42))","v":9},"Gr. 5","NIKODY Aleksandra ",2009,"SKN Jasło przy ZSM Nr 1",4,94,null,null,24,22,24,24,null,null,null,null,true]
[{"$f":"IF(Zawody_2021_klas_indywidualna[[#This Row],[Grupa]]=\"\",\"\",COUNTIF($B$3:B43,B43))","v":10},"Gr. 5","KULIGOWSKA Zofia ",2010,"UKS Śródmieście Przemyśl",2,56,28,28,null,null,null,null,null,null,null,null,true]
[{"$f":"IF(Zawody_2021_klas_indywidualna[[#This Row],[Grupa]]=\"\",\"\",COUNTIF($B$3:B44,B44))","v":1},"Gr. 6","ROGALIŃSKI Stefan ",2010,"UKN LAWORTA Ustrzyki Dolne",6,270,50,40,60,35,60,60,null,null,null,null,false]
[{"$f":"IF(Zawody_2021_klas_indywidualna[[#This Row],[Grupa]]=\"\",\"\",COUNTIF($B$3:B45,B45))","v":2},"Gr. 6","SEMP Damian ",2009,"KN Przemyśl SKI",6,270,60,50,50,60,50,50,null,null,null,null,false]
[{"$f":"IF(Zawody_2021_klas_indywidualna[[#This Row],[Grupa]]=\"\",\"\",COUNTIF($B$3:B46,B46))","v":3},"Gr. 6","SZOPNIEWSKI Adam ",2009,"SKN Jasło przy ZSM Nr 1",5,195,35,30,null,50,40,40,null,null,null,null,false]
[{"$f":"IF(Zawody_2021_klas_indywidualna[[#This Row],[Grupa]]=\"\",\"\",COUNTIF($B$3:B47,B47))","v":4},"Gr. 6","JANDURA Adam ",2009,"SKN Jasło przy ZSM Nr 1",6,173,28,28,35,40,35,35,null,null,null,null,false]
[{"$f":"IF(Zawody_2021_klas_indywidualna[[#This Row],[Grupa]]=\"\",\"\",COUNTIF($B$3:B48,B48))","v":5},"Gr. 6","KUŁAK Szymon ",2009,"KN Przemyśl SKI",3,115,40,35,40,null,null,null,null,null,null,null,false]
[{"$f":"IF(Zawody_2021_klas_indywidualna[[#This Row],[Grupa]]=\"\",\"\",COUNTIF($B$3:B49,B49))","v":6},"Gr. 6","KUTER Krzysztof ",2009,"UKN LAWORTA Ustrzyki Dolne",2,90,null,60,null,30,null,null,null,null,null,null,false]
[{"$f":"IF(Zawody_2021_klas_indywidualna[[#This Row],[Grupa]]=\"\",\"\",COUNTIF($B$3:B50,B50))","v":7},"Gr. 6","ŁUKASIEWICZ Olek ",2009,"PTN Przemyśl",2,56,30,26,null,null,null,null,null,null,null,null,false]
[{"$f":"IF(Zawody_2021_klas_indywidualna[[#This Row],[Grupa]]=\"\",\"\",COUNTIF($B$3:B51,B51))","v":8},"Gr. 6","WOŚ Michał",2010,"UKS Śródmieście Przemyśl",1,30,null,null,null,null,null,30,null,null,null,null,false]
[{"$f":"IF(Zawody_2021_klas_indywidualna[[#This Row],[Grupa]]=\"\",\"\",COUNTIF($B$3:B52,B52))","v":9},"Gr. 6","WIKTORSKI Kacper",2009,"UKN LAWORTA Ustrzyki Dolne",1,28,null,null,null,null,null,28,null,null,null,null,false]
[{"$f":"IF(Zawody_2021_klas_indywidualna[[#This Row],[Grupa]]=\"\",\"\",COUNTIF($B$3:B53,B53))","v":10},"Gr. 6","DZIURZYŃSKI Szymon ",2010,"PTN Przemyśl",1,26,26,null,null,null,null,null,null,null,null,null,false]
[{"$f":"IF(Zawody_2021_klas_indywidualna[[#This Row],[Grupa]]=\"\",\"\",COUNTIF($B$3:B54,B54))","v":1},"Gr. 7","KĄDZIOŁKA Pola ",2007,"UKN LAWORTA Ustrzyki Dolne",6,300,60,60,60,60,60,60,null,null,null,null,true]
[{"$f":"IF(Zawody_2021_klas_indywidualna[[#This Row],[Grupa]]=\"\",\"\",COUNTIF($B$3:B55,B55))","v":2},"Gr. 7","ELMERYCH Maria ",2008,"UKN LAWORTA Ustrzyki Dolne",5,230,40,50,null,40,50,50,null,null,null,null,true]
[{"$f":"IF(Zawody_2021_klas_indywidualna[[#This Row],[Grupa]]=\"\",\"\",COUNTIF($B$3:B56,B56))","v":3},"Gr. 7","KOWALSKA Julia ",2008,"UKN LAWORTA Ustrzyki Dolne",6,230,50,40,50,50,40,35,null,null,null,null,true]
[{"$f":"IF(Zawody_2021_klas_indywidualna[[#This Row],[Grupa]]=\"\",\"\",COUNTIF($B$3:B57,B57))","v":4},"Gr. 7","BAŁABAN Maria ",2007,"UKN LAWORTA Ustrzyki Dolne",6,170,30,35,40,28,35,30,null,null,null,null,true]
[{"$f":"IF(Zawody_2021_klas_indywidualna[[#This Row],[Grupa]]=\"\",\"\",COUNTIF($B$3:B58,B58))","v":5},"Gr. 7","KOCHANOWICZ Blanka ",2008,"UKN LAWORTA Ustrzyki Dolne",6,170,35,30,35,30,30,40,null,null,null,null,true]
[{"$f":"IF(Zawody_2021_klas_indywidualna[[#This Row],[Grupa]]=\"\",\"\",COUNTIF($B$3:B59,B59))","v":6},"Gr. 7","SOWA Nikola ",2007,"KN Przemyśl SKI",5,124,22,24,26,26,26,null,null,null,null,null,true]
[{"$f":"IF(Zawody_2021_klas_indywidualna[[#This Row],[Grupa]]=\"\",\"\",COUNTIF($B$3:B60,B60))","v":7},"Gr. 7","STRUSIEWICZ Julia ",2007,"UKN LAWORTA Ustrzyki Dolne",4,115,26,26,28,35,null,null,null,null,null,null,true]
[{"$f":"IF(Zawody_2021_klas_indywidualna[[#This Row],[Grupa]]=\"\",\"\",COUNTIF($B$3:B61,B61))","v":8},"Gr. 7","DZIWISZ Julia ",2008,"UKN LAWORTA Ustrzyki Dolne",3,86,28,28,30,null,null,null,null,null,null,null,true]
[{"$f":"IF(Zawody_2021_klas_indywidualna[[#This Row],[Grupa]]=\"\",\"\",COUNTIF($B$3:B62,B62))","v":9},"Gr. 7","DACKO Pola ",2008,"UKN LAWORTA Ustrzyki Dolne",3,80,null,null,null,24,28,28,null,null,null,null,true]
[{"$f":"IF(Zawody_2021_klas_indywidualna[[#This Row],[Grupa]]=\"\",\"\",COUNTIF($B$3:B63,B63))","v":10},"Gr. 7","KĘSICKA Lilianna ",2007,"KN Przemyśl SKI",1,24,24,null,null,null,null,null,null,null,null,null,true]
[{"$f":"IF(Zawody_2021_klas_indywidualna[[#This Row],[Grupa]]=\"\",\"\",COUNTIF($B$3:B64,B64))","v":1},"Gr. 8","BERNAT Karol ",2007,"KN Gondola Krynica",6,300,60,60,60,60,60,60,null,null,null,null,false]
[{"$f":"IF(Zawody_2021_klas_indywidualna[[#This Row],[Grupa]]=\"\",\"\",COUNTIF($B$3:B65,B65))","v":2},"Gr. 8","WIEJOWSKI Michał ",2008,"KN Gondola Krynica",5,230,40,40,50,50,null,50,null,null,null,null,false]
[{"$f":"IF(Zawody_2021_klas_indywidualna[[#This Row],[Grupa]]=\"\",\"\",COUNTIF($B$3:B66,B66))","v":3},"Gr. 8","KRYDA Mikołaj ",2008,"UKN LAWORTA Ustrzyki Dolne",6,215,50,50,35,28,50,30,null,null,null,null,false]
[{"$f":"IF(Zawody_2021_klas_indywidualna[[#This Row],[Grupa]]=\"\",\"\",COUNTIF($B$3:B67,B67))","v":4},"Gr. 8","JUCOS Piotr ",2008,"UKN LAWORTA Ustrzyki Dolne",6,185,35,35,40,40,35,35,null,null,null,null,{"$f":"IF(B67=\"\",\"\",MOD(IF(B67=B66,R66,R66+1),2)=1)","v":false}]
[{"$f":"IF(Zawody_2021_klas_indywidualna[[#This Row],[Grupa]]=\"\",\"\",COUNTIF($B$3:B68,B68))","v":5},"Gr. 8","TŁUCZEK Kasper ",2007,"KN Przemyśl SKI",6,175,30,30,30,35,40,40,null,null,null,null,false]
[{"$f":"IF(Zawody_2021_klas_indywidualna[[#This Row],[Grupa]]=\"\",\"\",COUNTIF($B$3:B69,B69))","v":6},"Gr. 8","BIERNACKI Kacper ",2008,"SKN Jasło przy ZSM Nr 1",5,142,28,null,28,30,28,28,null,null,null,null,false]
[{"$f":"IF(Zawody_2021_klas_indywidualna[[#This Row],[Grupa]]=\"\",\"\",COUNTIF($B$3:B70,B70))","v":7},"Gr. 8","SMOTRYCKI Maksymilian ",2008,"KN Przemyśl SKI",1,30,null,null,null,null,30,null,null,null,null,null,false]
[{"$f":"IF(Zawody_2021_klas_indywidualna[[#This Row],[Grupa]]=\"\",\"\",COUNTIF($B$3:B71,B71))","v":8},"Gr. 8","KOWALSKI Kamil ",2008,"UKN LAWORTA Ustrzyki Dolne",1,28,null,28,null,null,null,null,null,null,null,null,false]
[{"$f":"IF(Zawody_2021_klas_indywidualna[[#This Row],[Grupa]]=\"\",\"\",COUNTIF($B$3:B72,B72))","v":1},"Gr. 9","WĘGLOWSKA Laura ",2005,"UKN LAWORTA Ustrzyki Dolne",3,180,null,null,null,60,60,60,null,null,null,null,true]
[{"$f":"IF(Zawody_2021_klas_indywidualna[[#This Row],[Grupa]]=\"\",\"\",COUNTIF($B$3:B73,B73))","v":2},"Gr. 9","KUTER Katarzyna ",2005,"UKN LAWORTA Ustrzyki Dolne",1,60,null,null,60,null,null,null,null,null,null,null,true]
[{"$f":"IF(Zawody_2021_klas_indywidualna[[#This Row],[Grupa]]=\"\",\"\",COUNTIF($B$3:B74,B74))","v":3},"Gr. 9","WOLAN Sylwia",2006,"UKS Gwożdzik Gwoźnica D.",1,50,null,null,null,null,null,50,null,null,null,null,true]
[{"$f":"IF(Zawody_2021_klas_indywidualna[[#This Row],[Grupa]]=\"\",\"\",COUNTIF($B$3:B75,B75))","v":1},"Gr. 10","GRĘDA Jakub ",2006,"UKN LAWORTA Ustrzyki Dolne",5,280,60,50,60,60,50,null,null,null,null,null,false]
[{"$f":"IF(Zawody_2021_klas_indywidualna[[#This Row],[Grupa]]=\"\",\"\",COUNTIF($B$3:B76,B76))","v":2},"Gr. 10","GAJDEK Filip ",2005,"UKN LAWORTA Ustrzyki Dolne",6,280,50,60,40,50,60,60,null,null,null,null,false]
[{"$f":"IF(Zawody_2021_klas_indywidualna[[#This Row],[Grupa]]=\"\",\"\",COUNTIF($B$3:B77,B77))","v":3},"Gr. 10","SZCZEPAŃSKI Jan ",2006,"UKN LAWORTA Ustrzyki Dolne",5,210,40,40,null,40,40,50,null,null,null,null,false]
[{"$f":"IF(Zawody_2021_klas_indywidualna[[#This Row],[Grupa]]=\"\",\"\",COUNTIF($B$3:B78,B78))","v":4},"Gr. 10","FISCHER Rafał ",2006,"UKN LAWORTA Ustrzyki Dolne",5,185,30,null,50,30,35,40,null,null,null,null,false]
[{"$f":"IF(Zawody_2021_klas_indywidualna[[#This Row],[Grupa]]=\"\",\"\",COUNTIF($B$3:B79,B79))","v":5},"Gr. 10","DAROSZ Kacper ",2005,"UKN LAWORTA Ustrzyki Dolne",4,140,35,35,35,35,null,null,null,null,null,null,false]
[{"$f":"IF(Zawody_2021_klas_indywidualna[[#This Row],[Grupa]]=\"\",\"\",COUNTIF($B$3:B80,B80))","v":6},"Gr. 10","PIĘKOŚ Jakub ",2005,"SKN Jasło przy ZSM Nr 1",4,114,26,28,null,null,30,30,null,null,null,null,false]
[{"$f":"IF(Zawody_2021_klas_indywidualna[[#This Row],[Grupa]]=\"\",\"\",COUNTIF($B$3:B81,B81))","v":7},"Gr. 10","SZOPNIEWSKI Kamil ",2005,"SKN Jasło przy ZSM Nr 1",2,63,null,null,null,null,28,35,null,null,null,null,false]
[{"$f":"IF(Zawody_2021_klas_indywidualna[[#This Row],[Grupa]]=\"\",\"\",COUNTIF($B$3:B82,B82))","v":8},"Gr. 10","WITKA Jakub ",2006,"UKN LAWORTA Ustrzyki Dolne",2,58,28,30,null,null,null,null,null,null,null,null,false]
[{"$f":"IF(Zawody_2021_klas_indywidualna[[#This Row],[Grupa]]=\"\",\"\",COUNTIF($B$3:B83,B83))","v":9},"Gr. 10","DROZD Sebastian ",2006,"UKS Gwożdzik Gwoźnica D.",1,28,null,null,null,28,null,null,null,null,null,null,false]
[{"$f":"IF(Zawody_2021_klas_indywidualna[[#This Row],[Grupa]]=\"\",\"\",COUNTIF($B$3:B84,B84))","v":1},"Gr. 11","KĄDZIOŁKA Oliwia ",2003,"UKN LAWORTA Ustrzyki Dolne",6,300,60,60,60,60,60,60,null,null,null,null,true]
[{"$f":"IF(Zawody_2021_klas_indywidualna[[#This Row],[Grupa]]=\"\",\"\",COUNTIF($B$3:B85,B85))","v":2},"Gr. 11","GAWLIK Jagoda ",2003,"UKN LAWORTA Ustrzyki Dolne",6,250,50,50,50,50,50,50,null,null,null,null,true]
[{"$f":"IF(Zawody_2021_klas_indywidualna[[#This Row],[Grupa]]=\"\",\"\",COUNTIF($B$3:B86,B86))","v":1},"Gr. 12","OSIADACZ Brian ",2004,"UKN LAWORTA Ustrzyki Dolne",6,280,50,60,50,60,50,60,null,null,null,null,false]
[{"$f":"IF(Zawody_2021_klas_indywidualna[[#This Row],[Grupa]]=\"\",\"\",COUNTIF($B$3:B87,B87))","v":2},"Gr. 12","BABIARZ Dawid ",2002,"UKN LAWORTA Ustrzyki Dolne",4,230,60,null,60,null,60,50,null,null,null,null,false]
[{"$f":"IF(Zawody_2021_klas_indywidualna[[#This Row],[Grupa]]=\"\",\"\",COUNTIF($B$3:B88,B88))","v":3},"Gr. 12","DROZD Krystian ",2003,"UKS Gwożdzik Gwoźnica D.",4,170,null,null,40,50,40,40,null,null,null,null,false]
[{"$f":"IF(Zawody_2021_klas_indywidualna[[#This Row],[Grupa]]=\"\",\"\",COUNTIF($B$3:B89,B89))","v":4},"Gr. 12","WOLAN Mateusz ",2003,"UKS Gwożdzik Gwoźnica D.",4,145,null,null,35,40,35,35,null,null,null,null,false]
[{"$f":"IF(Zawody_2021_klas_indywidualna[[#This Row],[Grupa]]=\"\",\"\",COUNTIF($B$3:B90,B90))","v":5},"Gr. 12","SOŁTYS Mateusz ",2002,"UKS Gwożdzik Gwoźnica D.",1,35,null,null,null,35,null,null,null,null,null,null,false]
[{"$f":"IF(Zawody_2021_klas_indywidualna[[#This Row],[Grupa]]=\"\",\"\",COUNTIF($B$3:B91,B91))","v":6},"Gr. 12","ANTOŃ Kamil",2003,"UKS Gwożdzik Gwoźnica D.",1,30,null,null,null,null,30,null,null,null,null,null,false]
[{"$f":"IF(Zawody_2021_klas_indywidualna[[#This Row],[Grupa]]=\"\",\"\",COUNTIF($B$3:B92,B92))","v":1},"Gr. 13","KULIGOWSKA Oliwia ",1996,"KN Przemyśl SKI",2,120,60,60,null,null,null,null,null,null,null,null,true]
[{"$f":"IF(Zawody_2021_klas_indywidualna[[#This Row],[Grupa]]=\"\",\"\",COUNTIF($B$3:B93,B93))","v":2},"Gr. 13","DYDEK Aleksandra",1988,"UKS Gwożdzik Gwoźnica D.",1,60,null,null,null,null,60,null,null,null,null,null,true]
[{"$f":"IF(Zawody_2021_klas_indywidualna[[#This Row],[Grupa]]=\"\",\"\",COUNTIF($B$3:B94,B94))","v":1},"Gr. 14","PIĘCIAK Konrad",1988,"UKS Gwożdzik Gwoźnica D.",3,135,null,null,null,60,40,35,null,null,null,null,false]
[{"$f":"IF(Zawody_2021_klas_indywidualna[[#This Row],[Grupa]]=\"\",\"\",COUNTIF($B$3:B95,B95))","v":2},"Gr. 14","SMOLARZ Przemysław",1999,"UKS Gwożdzik Gwoźnica D.",2,90,null,null,null,null,50,40,null,null,null,null,false]
[{"$f":"IF(Zawody_2021_klas_indywidualna[[#This Row],[Grupa]]=\"\",\"\",COUNTIF($B$3:B96,B96))","v":3},"Gr. 14","BROŻEK Łukasz",1993,"UKS Gwożdzik Gwoźnica D.",1,60,null,null,null,null,60,null,null,null,null,null,false]
[{"$f":"IF(Zawody_2021_klas_indywidualna[[#This Row],[Grupa]]=\"\",\"\",COUNTIF($B$3:B97,B97))","v":4},"Gr. 14","NOWAK Michał",1993,"UKN LAWORTA Ustrzyki Dolne",1,60,null,null,null,null,null,60,null,null,null,null,false]
[{"$f":"IF(Zawody_2021_klas_indywidualna[[#This Row],[Grupa]]=\"\",\"\",COUNTIF($B$3:B98,B98))","v":5},"Gr. 14","OSTROWSKI Tomasz",1983,"UKN LAWORTA Ustrzyki Dolne",1,50,null,null,null,null,null,50,null,null,null,null,false]
[{"$f":"IF(Zawody_2021_klas_indywidualna[[#This Row],[Grupa]]=\"\",\"\",COUNTIF($B$3:B99,B99))","v":1},"Gr. 16","ELMERYCH Paweł ",1975,"UKN LAWORTA Ustrzyki Dolne",6,300,60,60,60,60,60,60,null,null,null,null,{"$f":"IF(B99=\"\",\"\",MOD(IF(B99=B98,R98,R98+1),2)=1)","v":true}]
[{"$f":"IF(Zawody_2021_klas_indywidualna[[#This Row],[Grupa]]=\"\",\"\",COUNTIF($B$3:B100,B100))","v":2},"Gr. 16","PROBULSKI Zbigniew ",1953,"Magura Gorlice",4,200,null,null,50,50,50,50,null,null,null,null,true]
[{"$f":"IF(Zawody_2021_klas_indywidualna[[#This Row],[Grupa]]=\"\",\"\",COUNTIF($B$3:B101,B101))","v":3},"Gr. 16","BABIARZ Wacław ",1969,"UKN LAWORTA Ustrzyki Dolne",6,200,50,40,40,40,30,26,null,null,null,null,true]
[{"$f":"IF(Zawody_2021_klas_indywidualna[[#This Row],[Grupa]]=\"\",\"\",COUNTIF($B$3:B102,B102))","v":4},"Gr. 16","WÓJCIK Tadeusz ",1950,"SKN Jasło przy ZSM Nr 1",6,171,40,35,35,35,26,24,null,null,null,null,true]
[{"$f":"IF(Zawody_2021_klas_indywidualna[[#This Row],[Grupa]]=\"\",\"\",COUNTIF($B$3:B103,B103))","v":5},"Gr. 16","GUDZELAK Józef ",1948,"KN Przemyśl SKI",2,85,35,50,null,null,null,null,null,null,null,null,true]
[{"$f":"IF(Zawody_2021_klas_indywidualna[[#This Row],[Grupa]]=\"\",\"\",COUNTIF($B$3:B104,B104))","v":6},"Gr. 16","CZELNY Janusz",1964,"Niestowarzyszony",2,80,null,null,null,null,40,40,null,null,null,null,true]
[{"$f":"IF(Zawody_2021_klas_indywidualna[[#This Row],[Grupa]]=\"\",\"\",COUNTIF($B$3:B105,B105))","v":7},"Gr. 16","BOBKO Zygmunt ",1956,"KN Przemyśl SKI",2,65,null,null,null,null,35,30,null,null,null,null,true]
[{"$f":"IF(Zawody_2021_klas_indywidualna[[#This Row],[Grupa]]=\"\",\"\",COUNTIF($B$3:B106,B106))","v":8},"Gr. 16","PORĘBA Adam ",1971,"UKS Gwożdzik Gwoźnica D.",2,52,null,null,30,null,null,22,null,null,null,null,true]
[{"$f":"IF(Zawody_2021_klas_indywidualna[[#This Row],[Grupa]]=\"\",\"\",COUNTIF($B$3:B107,B107))","v":9},"Gr. 16","PIĘKOŚ ANDRZEJ",1962,"SKN Jasło przy ZSM Nr 1",1,35,null,null,null,null,null,35,null,null,null,null,true]
[{"$f":"IF(Zawody_2021_klas_indywidualna[[#This Row],[Grupa]]=\"\",\"\",COUNTIF($B$3:B108,B108))","v":10},"Gr. 16","SZOPNIEWSKI Daniel ",1977,"SKN Jasło przy ZSM Nr 1",1,30,null,null,null,30,null,null,null,null,null,null,true]
[{"$f":"IF(Zawody_2021_klas_indywidualna[[#This Row],[Grupa]]=\"\",\"\",COUNTIF($B$3:B109,B109))","v":11},"Gr. 16","KOZA Maciej",1974,"Niestowarzyszony",1,28,null,null,null,null,null,28,null,null,null,null,true]
[{"$f":"IF(Zawody_2021_klas_indywidualna[[#This Row],[Grupa]]=\"\",\"\",COUNTIF($B$3:B110,B110))","v":12},"Gr. 16","STACHÓW Stanisław",1949,"UKS Śródmieście Przemyśl",1,28,null,null,null,null,28,null,null,null,null,null,{"$f":"IF(#REF!=\"\",\"\",MOD(IF(#REF!=B109,R109,R109+1),2)=1)","v":{"$error":"#REF!"}}]
[null,null,null,null,null,null,null,null,null,null,null,null,null,null,null,null,null,{"$f":"IF(#REF!=\"\",\"\",MOD(IF(#REF!=#REF!,R110,R110+1),2)=1)","v":{"$error":"#REF!"}}]
[null,null,null,null,null,null,null,null,null,null,null,null,null,null,null,null,null,{"$f":"IF(B110=\"\",\"\",MOD(IF(B110=#REF!,R111,R111+1),2)=1)","v":{"$error":"#REF!"}},{"$f":"IF(B110=\"\",\"\",MOD(IF(B110=#REF!,R111,R111+1),2)=1)","v":{"$error":"#REF!"}}]
[{"$f":"COUNT(Zawody_2021_klas_indywidualna[M-ce])","v":108},null,null,null,null,null,null,null,null,null,null,null,null,null,null,null,null,null,{"$f":"IF(B111=\"\",\"\",MOD(IF(B111=B110,S112,S112+1),2)=1)","v":""}]